BDBM33215 pyrazolopyridine, (Rac)-14::racemic
SMILES NCC1CN(CCO1)c1c(cnc2[nH]ncc12)-c1ccccc1
InChI Key InChIKey=YBRZCAKSBYWZTC-UHFFFAOYSA-N
Data  1 IC50
PDB links: 1 PDB ID matches this monomer.
  Tab Delimited (TSV)   2D SDfile   Computed 3D by Vconf -m prep SDfile
Find this compound or compounds like it in BindingDB:
Activity Spreadsheet -- Enzyme Inhibition Constant Data from BindingDB
Found 1 hit for monomerid = 33215
TargetSerine/threonine-protein kinase Chk1(Homo sapiens (Human))
The Institute Of Cancer Research
LigandPNGBDBM33215(pyrazolopyridine, (Rac)-14 | racemic)
Affinity DataIC50:  890nMpH: 7.5 T: 2°C. Assay description: CHK kinase function was measured in a DELFIA assay in order to monitor phosphorylation of a CDC25C peptide using a specific phospho antibody. The enz...