BDBM33250 phthalazine-based compound, 1
SMILES CC1CNC(=N1)c1ccc(Nc2nnc(Nc3ccc(cc3)C3=NC(C)CN3)c3ccccc23)cc1
InChI Key InChIKey=FWRRPLFTTHLPDY-UHFFFAOYSA-N
Data  5 IC50  2 Kd
  Tab Delimited (TSV)   2D SDfile   Computed 3D by Vconf -m prep SDfile
Find this compound or compounds like it in BindingDB:
Activity Spreadsheet -- Enzyme Inhibition Constant Data from BindingDB
Found 5 hits for monomerid = 33250
TargetGenome polyprotein [1393-1439,E1407V]/[1476-1660,R1508K,A1566M](Dengue virus 1(Hawaii))
Novartis Institute For Tropical Diseases
LigandPNGBDBM33250(phthalazine-based compound, 1)
Affinity DataIC50:  3.64E+4nMpH: 7.5 T: 2°C. Assay description: Inhibitors were assayed in a 96-well plate format. Typically, protease was preincubated with concentrations of test compounds at 37 deg C for 30 min....
In DepthDetails ArticlePubMed
TargetGenome polyprotein [1066-1250,R1182K]/[1394-1440,K1405R,D1408E](Dengue virus 2 (strain TSV01))
Novartis Institute For Tropical Diseases
LigandPNGBDBM33250(phthalazine-based compound, 1)
Affinity DataIC50:  6.00E+3nM Kd:  7.20E+3nMpH: 7.5 T: 2°C. Assay description: Inhibitors were assayed in a 96-well plate format. Typically, protease was preincubated with concentrations of test compounds at 37 deg C for 30 min....
In DepthDetails ArticlePubMed
TargetGenome polyprotein [1394-1440]/[1476-1660](Dengue virus 4 (H241))
Novartis Institute For Tropical Diseases
LigandPNGBDBM33250(phthalazine-based compound, 1)
Affinity DataIC50:  3.28E+4nM. Assay description: Inhibitors were assayed in a 96-well plate format. Typically, protease was preincubated with concentrations of test compounds at 37 deg C for 30 min....
In DepthDetails ArticlePubMed
TargetGenome polyprotein [1394-1440]/[1476-1660,T1585M](Dengue virus 3 (strain S221/03))
Novartis Institute For Tropical Diseases
LigandPNGBDBM33250(phthalazine-based compound, 1)
Affinity DataIC50:  1.75E+4nM. Assay description: Inhibitors were assayed in a 96-well plate format. Typically, protease was preincubated with concentrations of test compounds at 37 deg C for 30 min....
In DepthDetails ArticlePubMed
TargetGenome polyprotein [1424-1463]/[1502-1685](West Nile virus (WNV))
Novartis Institute For Tropical Diseases
LigandPNGBDBM33250(phthalazine-based compound, 1)
Affinity DataIC50:  2.45E+4nM Kd:  2.10E+4nMpH: 7.5 T: 2°C. Assay description: Inhibitors were assayed in a 96-well plate format. Typically, protease was preincubated with concentrations of test compounds at 37 deg C for 30 min....
In DepthDetails ArticlePubMed