BDBM33658 1-[3-(2-furanyl)-5-(methylthio)-1,2,4-triazol-1-yl]-3-phenyl-1-propanone::1-[3-(2-furyl)-5-(methylthio)-1,2,4-triazol-1-yl]-3-phenyl-propan-1-one::1-[3-(furan-2-yl)-5-methylsulfanyl-1,2,4-triazol-1-yl]-3-phenyl-propan-1-one::1-[3-(furan-2-yl)-5-methylsulfanyl-1,2,4-triazol-1-yl]-3-phenylpropan-1-one::3-(2-furyl)-5-(methylthio)-1-(3-phenylpropanoyl)-1H-1,2,4-triazole::MLS000536311::SMR000143349::cid_976848
SMILES CSc1nc(nn1C(=O)CCc1ccccc1)-c1ccco1
InChI Key InChIKey=NTBLKUKQLAUQNZ-UHFFFAOYSA-N
Data  1 IC50
  Tab Delimited (TSV)   2D SDfile   Computed 3D by Vconf -m prep SDfile
Find this compound or compounds like it in BindingDB:
Activity Spreadsheet -- Enzyme Inhibition Constant Data from BindingDB
Found 1 hit for monomerid = 33658
TargetProthrombin(Homo sapiens (Human))
Pcmd
Curated by PubChem BioAssay
LigandPNGBDBM33658(1-[3-(2-furanyl)-5-(methylthio)-1,2,4-triazol-1-yl...)
Affinity DataIC50:  5.51nMpH: 7.5 T: 2°C. Assay description: HTS was performed using 217,350 compounds of the MLSCN library individually plated into 10ul 1536 compound plates at a concentration of 2.5 mM each, ...
In DepthDetails PCBioAssay