BDBM33813 1-[5-(benzylamino)-3-phenyl-1,2,4-triazol-1-yl]-2-methoxy-ethanone::1-[5-(benzylamino)-3-phenyl-1,2,4-triazol-1-yl]-2-methoxyethanone::2-methoxy-1-[3-phenyl-5-[(phenylmethyl)amino]-1,2,4-triazol-1-yl]ethanone::MLS000675592::N-benzyl-1-(methoxyacetyl)-3-phenyl-1H-1,2,4-triazol-5-amine::SMR000294010::cid_978166
SMILES COCC(=O)n1nc(nc1NCc1ccccc1)-c1ccccc1
InChI Key InChIKey=QFVDRXOYYUEFBE-UHFFFAOYSA-N
Data  1 IC50
  Tab Delimited (TSV)   2D SDfile   Computed 3D by Vconf -m prep SDfile
Find this compound or compounds like it in BindingDB:
Activity Spreadsheet -- Enzyme Inhibition Constant Data from BindingDB
Found 1 hit for monomerid = 33813
TargetProthrombin(Homo sapiens (Human))
Pcmd
Curated by PubChem BioAssay
LigandPNGBDBM33813(1-[5-(benzylamino)-3-phenyl-1,2,4-triazol-1-yl]-2-...)
Affinity DataIC50:  246nMpH: 7.5 T: 2°C. Assay description: HTS was performed using 217,350 compounds of the MLSCN library individually plated into 10ul 1536 compound plates at a concentration of 2.5 mM each, ...
In DepthDetails PCBioAssay