BDBM33855 1-[5-[(4-methoxyphenyl)methylamino]-3-(3-pyridinyl)-1,2,4-triazol-1-yl]-2-methyl-1-propanone::1-[5-[(4-methoxyphenyl)methylamino]-3-pyridin-3-yl-1,2,4-triazol-1-yl]-2-methyl-propan-1-one::1-[5-[(4-methoxyphenyl)methylamino]-3-pyridin-3-yl-1,2,4-triazol-1-yl]-2-methylpropan-1-one::2-methyl-1-[5-(p-anisylamino)-3-(3-pyridyl)-1,2,4-triazol-1-yl]propan-1-one::MLS000765764::SMR000278870::cid_5129485
SMILES COc1ccc(CNc2nc(nn2C(=O)C(C)C)-c2cccnc2)cc1
InChI Key InChIKey=OYPHTBKTZCNURT-UHFFFAOYSA-N
Data  1 IC50
  Tab Delimited (TSV)   2D SDfile   Computed 3D by Vconf -m prep SDfile
Find this compound or compounds like it in BindingDB:
Activity Spreadsheet -- Enzyme Inhibition Constant Data from BindingDB
Found 1 hit for monomerid = 33855
TargetProthrombin(Homo sapiens (Human))
Pcmd
Curated by PubChem BioAssay
LigandPNGBDBM33855(1-[5-[(4-methoxyphenyl)methylamino]-3-(3-pyridinyl...)
Affinity DataIC50:  167nMpH: 7.5 T: 2°C. Assay description: HTS was performed using 217,350 compounds of the MLSCN library individually plated into 10ul 1536 compound plates at a concentration of 2.5 mM each, ...
In DepthDetails PCBioAssay