BDBM34377 3-keto-2-pyrrolidino-4H-1,4-benzothiazine-6-carboxylic acid::3-oxidanylidene-2-pyrrolidin-1-yl-4H-1,4-benzothiazine-6-carboxylic acid::3-oxo-2-(1-pyrrolidinyl)-4H-1,4-benzothiazine-6-carboxylic acid::3-oxo-2-pyrrolidin-1-yl-3,4-dihydro-2H-1,4-benzothiazine-6-carboxylic acid::3-oxo-2-pyrrolidin-1-yl-4H-1,4-benzothiazine-6-carboxylic acid::MLS000045953::SMR000031562::cid_3240735
SMILES OC(=O)c1ccc2SC(N3CCCC3)C(=O)Nc2c1
InChI Key InChIKey=GHLRMVGRWNFHBZ-UHFFFAOYSA-N
Data  3 IC50
  Tab Delimited (TSV)   2D SDfile   Computed 3D by Vconf -m prep SDfile
Find this compound or compounds like it in BindingDB:
Activity Spreadsheet -- Enzyme Inhibition Constant Data from BindingDB
Found 3 hits for monomerid = 34377
TargetGag-Pol polyprotein(Human immunodeficiency virus type 1 group M subtyp...)
University Of Pittsburgh
Curated by PubChem BioAssay
LigandPNGBDBM34377(3-keto-2-pyrrolidino-4H-1,4-benzothiazine-6-carbox...)
Affinity DataIC50:  3.69E+3nMpH: 8.0 T: 2°C. Assay description: A fluorescence resonance energy transfer assay is developed in 96-well and 384-well microplate formats with robotic manipulation to enable high-throu...
In DepthDetails PCBioAssay
TargetPolyadenylate-binding protein 1(Homo sapiens (Human))
Burnham Center For Chemical Genomics
Curated by PubChem BioAssay
LigandPNGBDBM34377(3-keto-2-pyrrolidino-4H-1,4-benzothiazine-6-carbox...)
Affinity DataIC50: >6.60E+4nM. Assay description: Data Source: Sanford-Burnham Center for Chemical Genomics (SBCCG) Source Affiliation: Sanford-Burnham Medical Research Institute (SBMRI, San Diego, C...
In DepthDetails PCBioAssay
TargetPolyadenylate-binding protein 1(Homo sapiens (Human))
Burnham Center For Chemical Genomics
Curated by PubChem BioAssay
LigandPNGBDBM34377(3-keto-2-pyrrolidino-4H-1,4-benzothiazine-6-carbox...)
Affinity DataIC50:  5.56E+4nM. Assay description: Data Source: Sanford-Burnham Center for Chemical Genomics (SBCCG) Source Affiliation: Sanford-Burnham Medical Research Institute (SBMRI, San Diego, C...
In DepthDetails PCBioAssay