BDBM349919 (2R,5S)-4-(1-(5-amino-4H-1,2,4-triazol-3-yl)piperidin-4-yl)-5-(4-chlorobenzyl)morpholine-2-carboxamide ::US10208020, Example 9::US10538508, Example 9::US9944624, Ex. 9
SMILES NC(=O)[C@H]1CN(C(Cc2ccc(Cl)cc2)CO1)C1CCN(CC1)c1nnc(N)[nH]1
InChI Key
Data  6 IC50
  Tab Delimited (TSV)   2D SDfile   Computed 3D by Vconf -m prep SDfile
Find this compound or compounds like it in BindingDB:
Activity Spreadsheet -- Enzyme Inhibition Constant Data from BindingDB
Found 6 hits for monomerid = 349919
TargetAcidic mammalian chitinase(Homo sapiens (Human))
Oncoarendi Therapeutics
US Patent
LigandPNGBDBM349919((2R,5S)-4-(1-(5-amino-4H-1,2,4-triazol-3-yl)piperi...)
Affinity DataIC50: <100nM. Assay description: An enzymatic assay with recombinant human AMCase was used in order to establish inhibitory activity of the compounds (Boot et al., 2001, JBC: 276). T...
Ligand InfoPC cidPC sid
In DepthDetails US Patent
TargetChitotriosidase-1(Homo sapiens (Human))
Oncoarendi Therapeutics
US Patent
LigandPNGBDBM349919((2R,5S)-4-(1-(5-amino-4H-1,2,4-triazol-3-yl)piperi...)
Affinity DataIC50: <100nM. Assay description: An enzymatic assay with recombinant human CHIT1 was used in order to establish inhibitory activity of the compounds (Boot et al., 2001, JBC: 276). Th...
Ligand InfoPC cidPC sid
In DepthDetails US Patent
TargetChitotriosidase-1(Homo sapiens (Human))
Oncoarendi Therapeutics
US Patent
LigandPNGBDBM349919((2R,5S)-4-(1-(5-amino-4H-1,2,4-triazol-3-yl)piperi...)
Affinity DataIC50: <100nM. Assay description: An enzymatic assay with recombinant human CHIT1 was used in order to establish inhibitory activity of the compounds (Boot et al., 2001, JBC: 276). Th...
Ligand InfoPC cidPC sid
In DepthDetails US Patent
TargetChitotriosidase-1(Homo sapiens (Human))
Oncoarendi Therapeutics
US Patent
LigandPNGBDBM349919((2R,5S)-4-(1-(5-amino-4H-1,2,4-triazol-3-yl)piperi...)
Affinity DataIC50: <100nM. Assay description: An enzymatic assay with recombinant human CHIT1 was used in order to establish inhibitory activity of the compounds (Boot et al., 2001, JBC: 276). Th...
Ligand InfoPC cidPC sid
In DepthDetails US Patent
TargetAcidic mammalian chitinase(Homo sapiens (Human))
Oncoarendi Therapeutics
US Patent
LigandPNGBDBM349919((2R,5S)-4-(1-(5-amino-4H-1,2,4-triazol-3-yl)piperi...)
Affinity DataIC50: <100nM. Assay description: An enzymatic assay with recombinant human AMCase was used in order to establish inhibitory activity of the compounds (Boot et al., 2001, JBC: 276). T...
Ligand InfoPC cidPC sid
In DepthDetails US Patent
TargetAcidic mammalian chitinase(Homo sapiens (Human))
Oncoarendi Therapeutics
US Patent
LigandPNGBDBM349919((2R,5S)-4-(1-(5-amino-4H-1,2,4-triazol-3-yl)piperi...)
Affinity DataIC50: <100nM. Assay description: An enzymatic assay with recombinant human AMCase was used in order to establish inhibitory activity of the compounds (Boot et al., 2001, JBC: 276). T...
Ligand InfoPC cidPC sid
In DepthDetails US Patent