BDBM349941 5-(4-((2S,5S)-2,5-bis(4-chlorobenzyl)-4-methylpiperazin-1-yl)piperidin-1-yl)-4H-1,2,4-triazol-3-amine ::US10208020, Example 31::US11638707, Example C10.
SMILES CN1C[C@H](Cc2ccc(Cl)cc2)N(C[C@@H]1Cc1ccc(Cl)cc1)C1CCN(CC1)c1nnc(N)[nH]1
InChI Key
Data  3 IC50
  Tab Delimited (TSV)   2D SDfile   Computed 3D by Vconf -m prep SDfile
Find this compound or compounds like it in BindingDB:
Activity Spreadsheet -- Enzyme Inhibition Constant Data from BindingDB
Found 3 hits for monomerid = 349941
TargetAcidic mammalian chitinase(Homo sapiens (Human))
Oncoarendi Therapeutics
US Patent
LigandPNGBDBM349941(5-(4-((2S,5S)-2,5-bis(4-chlorobenzyl)-4-methylpipe...)
Affinity DataIC50: <100nM. Assay description: An enzymatic assay with recombinant human AMCase was used in order to establish inhibitory activity of the compounds (Boot et al., 2001, JBC: 276). T...
Ligand InfoPC cidPC sid
In DepthDetails US Patent
TargetPotassium voltage-gated channel subfamily H member 2(Homo sapiens (Human))
Molecure
US Patent
LigandPNGBDBM349941(5-(4-((2S,5S)-2,5-bis(4-chlorobenzyl)-4-methylpipe...)
Affinity DataIC50: <1.00E+3nM. Assay description: Fluorescence polarization assay based on the principle of fluorescence polarization where a red-shifted fluorescent tracer is displaced from the hERG...
Ligand InfoPC cidPC sid
In DepthDetails US Patent
TargetChitotriosidase-1(Homo sapiens (Human))
Oncoarendi Therapeutics
US Patent
LigandPNGBDBM349941(5-(4-((2S,5S)-2,5-bis(4-chlorobenzyl)-4-methylpipe...)
Affinity DataIC50:  5.50E+3nM. Assay description: An enzymatic assay with recombinant human CHIT1 was used in order to establish inhibitory activity of the compounds (Boot et al., 2001, JBC: 276). Th...
Ligand InfoPC cidPC sid
In DepthDetails US Patent