BDBM350619 (2S)-N-(2-amino-2-oxoethyl)- 2-{[(4-bromo-2- fluorophenyl)carbamoyl]amino} pentanamide::US10208071, Compound 81::US10434112, Compound 81::US10799518, Compound 81
SMILES CCC[C@H](NC(=O)Nc1ccc(Br)cc1F)C(=O)NCC(N)=O
InChI Key InChIKey=JYWZBPJPSWXWPV-NSHDSACASA-N
Data  3 EC50
  Tab Delimited (TSV)   2D SDfile   Computed 3D by Vconf -m prep SDfile
Find this compound or compounds like it in BindingDB:
Activity Spreadsheet -- Enzyme Inhibition Constant Data from BindingDB
Found 3 hits for monomerid = 350619
TargetN-formyl peptide receptor 2(Homo sapiens (Human))
Allergan
US Patent
LigandPNGBDBM350619((2S)-N-(2-amino-2-oxoethyl)- 2-{[(4-bromo-2- fluor...)
Affinity DataEC50:  5.20E+3nM. Assay description: HEK-Gα16 cells stably expressing the human FPR2 receptor was utilized. Cells were plated into 384-well poly-D-lysine coated plates at a density ...
Ligand InfoPC cidPC sid
In DepthDetails US Patent
TargetN-formyl peptide receptor 2(Homo sapiens (Human))
Allergan
US Patent
LigandPNGBDBM350619((2S)-N-(2-amino-2-oxoethyl)- 2-{[(4-bromo-2- fluor...)
Affinity DataEC50:  5.20nM. Assay description: HEK-Gα16 cells stably expressing the human FPR2 receptor was utilized. Cells were plated into 384-well poly-D-lysine coated plates at a density ...
Ligand InfoPC cidPC sid
In DepthDetails US Patent
TargetN-formyl peptide receptor 2(Homo sapiens (Human))
Allergan
US Patent
LigandPNGBDBM350619((2S)-N-(2-amino-2-oxoethyl)- 2-{[(4-bromo-2- fluor...)
Affinity DataEC50:  5.20nM. Assay description: HEK-Gα16 cells stably expressing the human FPR2 receptor was utilized. Cells were plated into 384-well poly-D-lysine coated plates at a density ...
Ligand InfoPC cidPC sid
In DepthDetails US Patent