BDBM350620 1-(4-bromophenyl)-3-{4-[2-(4- fluorophenyl)ethyl]-4-methyl- 2,5-dioxoimidazolidin-1- yl}urea::US10208071, Compound 82::US10434112, Compound 82::US10799518, Compound 82
SMILES CC1(CCc2ccc(F)cc2)NC(=O)N(NC(=O)Nc2ccc(Br)cc2)C1=O
InChI Key InChIKey=ULVPSGVKNAVGBA-UHFFFAOYSA-N
Data  3 EC50
  Tab Delimited (TSV)   2D SDfile   Computed 3D by Vconf -m prep SDfile
Find this compound or compounds like it in BindingDB:
Activity Spreadsheet -- Enzyme Inhibition Constant Data from BindingDB
Found 3 hits for monomerid = 350620
TargetN-formyl peptide receptor 2(Homo sapiens (Human))
Allergan
US Patent
LigandPNGBDBM350620(1-(4-bromophenyl)-3-{4-[2-(4- fluorophenyl)ethyl]-...)
Affinity DataEC50:  1.63E+4nM. Assay description: HEK-Gα16 cells stably expressing the human FPR2 receptor was utilized. Cells were plated into 384-well poly-D-lysine coated plates at a density ...
Ligand InfoPC cidPC sid
In DepthDetails US Patent
TargetN-formyl peptide receptor 2(Homo sapiens (Human))
Allergan
US Patent
LigandPNGBDBM350620(1-(4-bromophenyl)-3-{4-[2-(4- fluorophenyl)ethyl]-...)
Affinity DataEC50:  16.3nM. Assay description: HEK-Gα16 cells stably expressing the human FPR2 receptor was utilized. Cells were plated into 384-well poly-D-lysine coated plates at a density ...
Ligand InfoPC cidPC sid
In DepthDetails US Patent
TargetN-formyl peptide receptor 2(Homo sapiens (Human))
Allergan
US Patent
LigandPNGBDBM350620(1-(4-bromophenyl)-3-{4-[2-(4- fluorophenyl)ethyl]-...)
Affinity DataEC50:  16.3nM. Assay description: HEK-Gα16 cells stably expressing the human FPR2 receptor was utilized. Cells were plated into 384-well poly-D-lysine coated plates at a density ...
Ligand InfoPC cidPC sid
In DepthDetails US Patent