BDBM35411 MLS000092931::N-(2,5-dimethoxyphenyl)-2-[[5-[(1-methyl-2-pyrrolyl)methyl]-4-(2-phenylethyl)-1,2,4-triazol-3-yl]thio]acetamide::N-(2,5-dimethoxyphenyl)-2-[[5-[(1-methylpyrrol-2-yl)methyl]-4-(2-phenylethyl)-1,2,4-triazol-3-yl]sulfanyl]acetamide::N-(2,5-dimethoxyphenyl)-2-[[5-[(1-methylpyrrol-2-yl)methyl]-4-(2-phenylethyl)-1,2,4-triazol-3-yl]sulfanyl]ethanamide::N-(2,5-dimethoxyphenyl)-2-[[5-[(1-methylpyrrol-2-yl)methyl]-4-phenethyl-1,2,4-triazol-3-yl]thio]acetamide::N-(2,5-dimethoxyphenyl)-2-{[5-[(1-methyl-1H-pyrrol-2-yl)methyl]-4-(2-phenylethyl)-4H-1,2,4-triazol-3-yl]thio}acetamide::SMR000028567::cid_3244676
SMILES COc1ccc(OC)c(NC(=O)CSc2nnc(Cc3cccn3C)n2CCc2ccccc2)c1
InChI Key InChIKey=VPPNXHJCHCDRGL-UHFFFAOYSA-N
Data  2 IC50
  Tab Delimited (TSV)   2D SDfile   Computed 3D by Vconf -m prep SDfile
Find this compound or compounds like it in BindingDB:
Activity Spreadsheet -- Enzyme Inhibition Constant Data from BindingDB
Found 2 hits for monomerid = 35411
TargetDual specificity protein phosphatase 6(Rattus norvegicus)
University Of Pittsburgh
Curated by PubChem BioAssay
LigandPNGBDBM35411(MLS000092931 | N-(2,5-dimethoxyphenyl)-2-[[5-[(1-m...)
Affinity DataIC50: >5.00E+4nM. Assay description: The in vitro MKP-3 Phosphatase dose response hit/probe assessment assay has been developed and run at the University of Pittsburgh Molecular Screenin...
In DepthDetails PCBioAssay
TargetDual specificity protein phosphatase 1(Homo sapiens (Human))
University Of Pittsburgh
Curated by PubChem BioAssay
LigandPNGBDBM35411(MLS000092931 | N-(2,5-dimethoxyphenyl)-2-[[5-[(1-m...)
Affinity DataIC50: >5.00E+4nMpH: 7.0 T: 2°C. Assay description: The MKP-1 HTS confirmation dose response assay has been developed to confirm actives identified in the MH-76391 In vitro HTS assay for MKP-1 inhibito...
In DepthDetails PCBioAssay