BDBM35467 CC-PMLSC-DMA-P142::N'-[3-(cyclopropylmethyl)-1-methyl-2,6-bis(oxidanylidene)pyrimidin-4-yl]-N,N-dimethyl-methanimidamide::N'-[3-(cyclopropylmethyl)-1-methyl-2,6-dioxo-4-pyrimidinyl]-N,N-dimethylmethanimidamide::N'-[3-(cyclopropylmethyl)-1-methyl-2,6-dioxopyrimidin-4-yl]-N,N-dimethylmethanimidamide::N'-[3-(cyclopropylmethyl)-2,6-diketo-1-methyl-pyrimidin-4-yl]-N,N-dimethyl-formamidine::cid_9547723
SMILES CN(C)\C=N\c1cc(=O)n(C)c(=O)n1CC1CC1
InChI Key InChIKey=YEYXJVIFIFOOSA-MDWZMJQESA-N
Data  1 IC50
  Tab Delimited (TSV)   2D SDfile   Computed 3D by Vconf -m prep SDfile
Find this compound or compounds like it in BindingDB:
Activity Spreadsheet -- Enzyme Inhibition Constant Data from BindingDB
Found 1 hit for monomerid = 35467
TargetDual specificity protein phosphatase 1(Homo sapiens (Human))
Cc_Pmlsc
Curated by PubChem BioAssay
LigandPNGBDBM35467(CC-PMLSC-DMA-P142 | N'-[3-(cyclopropylmethyl)-1-me...)
Affinity DataIC50: >5.00E+4nMpH: 7.0 T: 2°C. Assay description: The MKP-1 dose response assay SAR support Assay - has been developed to test the activity of a series Analog compounds synthesized by the PMLSC Chemi...
In DepthDetails PCBioAssay