BDBM35955 4-pyridinoxy-2-anilinopyridine-based compound, 19
SMILES Cc1ccc(Oc2ccnc(Nc3ccc(cc3)S(N)(=O)=O)c2)c(C)n1
InChI Key InChIKey=UEOZXMAOIHDDQE-UHFFFAOYSA-N
Data  1 IC50  1 EC50
PDB links: 1 PDB ID matches this monomer.
  Tab Delimited (TSV)   2D SDfile   Computed 3D by Vconf -m prep SDfile
Find this compound or compounds like it in BindingDB:
Activity Spreadsheet -- Enzyme Inhibition Constant Data from BindingDB
Found 1 hit for monomerid = 35955
TargetTGF-beta receptor type-1(Homo sapiens (Human))
Astrazeneca
LigandPNGBDBM35955(4-pyridinoxy-2-anilinopyridine-based compound, 19)
Affinity DataIC50:  72nM EC50:  22nMpH: 7.4 T: 2°C. Assay description: A fluorescence polarization assay was used to assess the ALK5 binding capacity and biochemical activity of compounds. ALK5 protein was added to each ...