BDBM365024 S-4-(3-isopropyl-4,5-dihydro- 3H-1,2,2a1,5- tetraazaacenaphthylen-7-yl)- N-(1-methyl-1H-pyrazol-5- yl)pyrimidin-2-amine::US10517878, Compound I-3::US10842799, I-3::US9867833, Compound I-3
SMILES CC(C)[C@H]1CNc2cc(cc3nnc1n23)-c1ccnc(Nc2ccnn2C)n1
InChI Key InChIKey=MOFYFYAEOKPYPU-CYBMUJFWSA-N
Data  3 IC50
  Tab Delimited (TSV)   2D SDfile   Computed 3D by Vconf -m prep SDfile
Find this compound or compounds like it in BindingDB:
Activity Spreadsheet -- Enzyme Inhibition Constant Data from BindingDB
Found 3 hits for monomerid = 365024
TargetMitogen-activated protein kinase 1(Homo sapiens (Human))
Genentech
US Patent
LigandPNGBDBM365024(S-4-(3-isopropyl-4,5-dihydro- 3H-1,2,2a1,5- tetraa...)
Affinity DataIC50:  0.0390nM. Assay description: Compounds were tested in an enzymatic assay using human ERK-2 (Mitogen Activated Kinase 1), recombinantly expressed as an n-terminal 6-His fusion pro...
Ligand InfoPC cidPC sid
In DepthDetails US Patent
TargetMitogen-activated protein kinase 1(Homo sapiens (Human))
Genentech
US Patent
LigandPNGBDBM365024(S-4-(3-isopropyl-4,5-dihydro- 3H-1,2,2a1,5- tetraa...)
Affinity DataIC50:  0.0390nM. Assay description: Compounds were tested in an enzymatic assay using human ERK-2 (Mitogen Activated Kinase 1), recombinantly expressed as an n-terminal 6-His fusion pro...
Ligand InfoPC cidPC sid
In DepthDetails US Patent
TargetMitogen-activated protein kinase 1(Homo sapiens (Human))
Genentech
US Patent
LigandPNGBDBM365024(S-4-(3-isopropyl-4,5-dihydro- 3H-1,2,2a1,5- tetraa...)
Affinity DataIC50:  0.0390nM. Assay description: Compounds were tested in an enzymatic assay using human ERK-2 (Mitogen Activated Kinase 1), recombinantly expressed as an n-terminal 6-His fusion pro...
Ligand InfoPC cidPC sid
In DepthDetails US Patent