BDBM366093 US9873693, Compound 16
SMILES Fc1ccc(Cn2cccc(C(=O)NC3CCCc4ccc(cc34)-c3c[nH]c4ncccc34)c2=O)cc1F
InChI Key
Data  1 IC50
  Tab Delimited (TSV)   2D SDfile   Computed 3D by Vconf -m prep SDfile
Find this compound or compounds like it in BindingDB:
Activity Spreadsheet -- Enzyme Inhibition Constant Data from BindingDB
Found 1 hit for monomerid = 366093
Target3-phosphoinositide-dependent protein kinase 1 [51-360](Homo sapiens (Human))
Sunesis Pharmaceuticals
US Patent
LigandPNGBDBM366093(US9873693, Compound 16)
Affinity DataIC50: <500nM. Assay description: A PDK1 kinase assay was performed as follows. PDK1 (amino acids 51-360) and AKT2 (amino acids 140-467 fused to PIFtide, amino acids EEQEMFRDFDYIADW) ...
Ligand InfoPC cidPC sid
In DepthDetails US Patent