BDBM36944 (2-methylbenzofuro[3,2-d]pyrimidin-4-yl)-(1-phenylethyl)amine::2-methyl-N-(1-phenylethyl)-4-benzofuro[3,2-d]pyrimidinamine::2-methyl-N-(1-phenylethyl)-[1]benzofuro[3,2-d]pyrimidin-4-amine::MLS000041000::SMR000045907::cid_664914
SMILES CC(Nc1nc(C)nc2c3ccccc3oc12)c1ccccc1
InChI Key InChIKey=WGFCGMSZEPNYPI-UHFFFAOYSA-N
Data  2 IC50  3 EC50
  Tab Delimited (TSV)   2D SDfile   Computed 3D by Vconf -m prep SDfile
Find this compound or compounds like it in BindingDB:
Activity Spreadsheet -- Enzyme Inhibition Constant Data from BindingDB
Found 5 hits for monomerid = 36944
TargetSphingosine 1-phosphate receptor 1(Homo sapiens (Human))
The Scripps Research Institute Molecular Screening Center
Curated by PubChem BioAssay
LigandPNGBDBM36944((2-methylbenzofuro[3,2-d]pyrimidin-4-yl)-(1-phenyl...)
Affinity DataEC50:  9.78E+3nM. Assay description: Source (MLSCN Center Name): The Scripps Research Institute Molecular Screening Center Center Affiliation: The Scripps Research Institute, TSRI Assay ...
In DepthDetails PCBioAssay
TargetSphingosine 1-phosphate receptor 1(Homo sapiens (Human))
The Scripps Research Institute Molecular Screening Center
Curated by PubChem BioAssay
LigandPNGBDBM36944((2-methylbenzofuro[3,2-d]pyrimidin-4-yl)-(1-phenyl...)
Affinity DataEC50:  5.29E+4nM. Assay description: Source (MLSCN Center Name): The Scripps Research Institute Molecular Screening Center Center Affiliation: The Scripps Research Institute, TSRI Assay ...
In DepthDetails PCBioAssay
TargetSteroidogenic factor 1(Homo sapiens (Human))
The Scripps Research Institute Molecular Screening Center
Curated by PubChem BioAssay
LigandPNGBDBM36944((2-methylbenzofuro[3,2-d]pyrimidin-4-yl)-(1-phenyl...)
Affinity DataIC50:  2.31E+4nM. Assay description: Source (MLSCN Center Name): The Scripps Research Institute Molecular Screening Center Center Affiliation: The Scripps Research Institute, TSRI Assay ...
In DepthDetails PCBioAssay
TargetIsoform 2 of Nuclear receptor ROR-alpha (Alpha-2)(Homo sapiens (Human))
The Scripps Research Institute Molecular Screening Center
Curated by PubChem BioAssay
LigandPNGBDBM36944((2-methylbenzofuro[3,2-d]pyrimidin-4-yl)-(1-phenyl...)
Affinity DataIC50:  1.34E+4nM. Assay description: Source (MLSCN Center Name): The Scripps Research Institute Molecular Screening Center Center Affiliation: The Scripps Research Institute, TSRI Assay ...
In DepthDetails PCBioAssay
TargetSphingosine 1-phosphate receptor 1(Homo sapiens (Human))
The Scripps Research Institute Molecular Screening Center
Curated by PubChem BioAssay
LigandPNGBDBM36944((2-methylbenzofuro[3,2-d]pyrimidin-4-yl)-(1-phenyl...)
Affinity DataEC50:  6.97E+3nM. Assay description: Source (MLSCN Center Name): The Scripps Research Institute Molecular Screening Center Center Affiliation: The Scripps Research Institute, TSRI Assay ...
In DepthDetails PCBioAssay