BDBM36960 4-amino-N-[2-[[5-bromo-2-(4-fluorobenzyl)oxy-benzyl]amino]ethyl]furazan-3-carboxamide;hydrochloride::4-amino-N-[2-[[5-bromo-2-[(4-fluorophenyl)methoxy]phenyl]methylamino]ethyl]-1,2,5-oxadiazole-3-carboxamide;hydrochloride::4-azanyl-N-[2-[[5-bromanyl-2-[(4-fluorophenyl)methoxy]phenyl]methylamino]ethyl]-1,2,5-oxadiazole-3-carboxamide;hydrochloride::MLS000083799::SMR000048536::cid_6603206
SMILES Nc1nonc1C(=O)NCCNCc1cc(Br)ccc1OCc1ccc(F)cc1
InChI Key InChIKey=ZJDUGLXYCQDGDT-UHFFFAOYSA-N
Data  2 IC50  3 EC50
  Tab Delimited (TSV)   2D SDfile   Computed 3D by Vconf -m prep SDfile
Find this compound or compounds like it in BindingDB:
Activity Spreadsheet -- Enzyme Inhibition Constant Data from BindingDB
Found 5 hits for monomerid = 36960
TargetSphingosine 1-phosphate receptor 1(Homo sapiens (Human))
The Scripps Research Institute Molecular Screening Center
Curated by PubChem BioAssay
LigandPNGBDBM36960(4-amino-N-[2-[[5-bromo-2-(4-fluorobenzyl)oxy-benzy...)
Affinity DataEC50:  7.81E+3nM. Assay description: Source (MLSCN Center Name): The Scripps Research Institute Molecular Screening Center Center Affiliation: The Scripps Research Institute, TSRI Assay ...
In DepthDetails PCBioAssay
TargetSphingosine 1-phosphate receptor 1(Homo sapiens (Human))
The Scripps Research Institute Molecular Screening Center
Curated by PubChem BioAssay
LigandPNGBDBM36960(4-amino-N-[2-[[5-bromo-2-(4-fluorobenzyl)oxy-benzy...)
Affinity DataEC50:  3.05E+4nM. Assay description: Source (MLSCN Center Name): The Scripps Research Institute Molecular Screening Center Center Affiliation: The Scripps Research Institute, TSRI Assay ...
In DepthDetails PCBioAssay
TargetSteroidogenic factor 1(Homo sapiens (Human))
The Scripps Research Institute Molecular Screening Center
Curated by PubChem BioAssay
LigandPNGBDBM36960(4-amino-N-[2-[[5-bromo-2-(4-fluorobenzyl)oxy-benzy...)
Affinity DataIC50:  4.46E+3nM. Assay description: Source (MLSCN Center Name): The Scripps Research Institute Molecular Screening Center Center Affiliation: The Scripps Research Institute, TSRI Assay ...
In DepthDetails PCBioAssay
TargetIsoform 2 of Nuclear receptor ROR-alpha (Alpha-2)(Homo sapiens (Human))
The Scripps Research Institute Molecular Screening Center
Curated by PubChem BioAssay
LigandPNGBDBM36960(4-amino-N-[2-[[5-bromo-2-(4-fluorobenzyl)oxy-benzy...)
Affinity DataIC50:  5.44E+3nM. Assay description: Source (MLSCN Center Name): The Scripps Research Institute Molecular Screening Center Center Affiliation: The Scripps Research Institute, TSRI Assay ...
In DepthDetails PCBioAssay
TargetSphingosine 1-phosphate receptor 1(Homo sapiens (Human))
The Scripps Research Institute Molecular Screening Center
Curated by PubChem BioAssay
LigandPNGBDBM36960(4-amino-N-[2-[[5-bromo-2-(4-fluorobenzyl)oxy-benzy...)
Affinity DataEC50:  6.90E+3nM. Assay description: Source (MLSCN Center Name): The Scripps Research Institute Molecular Screening Center Center Affiliation: The Scripps Research Institute, TSRI Assay ...
In DepthDetails PCBioAssay