BDBM37009 2-(1-benzimidazolyl)acetic acid [2-[1-(4-methoxyphenyl)-2,5-dimethyl-3-pyrrolyl]-2-oxoethyl] ester::2-(benzimidazol-1-yl)acetic acid [2-keto-2-[1-(4-methoxyphenyl)-2,5-dimethyl-pyrrol-3-yl]ethyl] ester::MLS000082037::SMR000062694::[2-[1-(4-methoxyphenyl)-2,5-dimethyl-pyrrol-3-yl]-2-oxidanylidene-ethyl] 2-(benzimidazol-1-yl)ethanoate::[2-[1-(4-methoxyphenyl)-2,5-dimethylpyrrol-3-yl]-2-oxoethyl] 2-(benzimidazol-1-yl)acetate::cid_2421595
SMILES COc1ccc(cc1)-n1c(C)cc(C(=O)COC(=O)Cn2cnc3ccccc23)c1C
InChI Key InChIKey=DMMIKXQNMAPFBA-UHFFFAOYSA-N
Data  1 IC50  3 EC50
  Tab Delimited (TSV)   2D SDfile   Computed 3D by Vconf -m prep SDfile
Find this compound or compounds like it in BindingDB:
Activity Spreadsheet -- Enzyme Inhibition Constant Data from BindingDB
Found 4 hits for monomerid = 37009
TargetSphingosine 1-phosphate receptor 1(Homo sapiens (Human))
The Scripps Research Institute Molecular Screening Center
Curated by PubChem BioAssay
LigandPNGBDBM37009(2-(1-benzimidazolyl)acetic acid [2-[1-(4-methoxyph...)
Affinity DataEC50:  1.16E+4nM. Assay description: Source (MLSCN Center Name): The Scripps Research Institute Molecular Screening Center Center Affiliation: The Scripps Research Institute, TSRI Assay ...
Ligand InfoPC cidPC sid
In DepthDetails PCBioAssay
TargetGalanin receptor type 3(Homo sapiens (Human))
The Scripps Research Institute Molecular Screening Center
Curated by PubChem BioAssay
LigandPNGBDBM37009(2-(1-benzimidazolyl)acetic acid [2-[1-(4-methoxyph...)
Affinity DataIC50:  762nM
Ligand InfoPC cidPC sid
In DepthDetails PCBioAssay
TargetSphingosine 1-phosphate receptor 1(Homo sapiens (Human))
The Scripps Research Institute Molecular Screening Center
Curated by PubChem BioAssay
LigandPNGBDBM37009(2-(1-benzimidazolyl)acetic acid [2-[1-(4-methoxyph...)
Affinity DataEC50:  1.03E+4nM. Assay description: Source (MLSCN Center Name): The Scripps Research Institute Molecular Screening Center Center Affiliation: The Scripps Research Institute, TSRI Assay ...
Ligand InfoPC cidPC sid
In DepthDetails PCBioAssay
TargetSphingosine 1-phosphate receptor 1(Homo sapiens (Human))
The Scripps Research Institute Molecular Screening Center
Curated by PubChem BioAssay
LigandPNGBDBM37009(2-(1-benzimidazolyl)acetic acid [2-[1-(4-methoxyph...)
Affinity DataEC50: >3.00E+4nM. Assay description: Source (MLSCN Center Name): The Scripps Research Institute Molecular Screening Center Center Affiliation: The Scripps Research Institute, TSRI Assay ...
Ligand InfoPC cidPC sid
In DepthDetails PCBioAssay