BDBM37109 MLS000049114::N-[2-(3-chloranyl-4-methoxy-phenyl)benzotriazol-5-yl]methanesulfonamide::N-[2-(3-chloro-4-methoxy-phenyl)benzotriazol-5-yl]methanesulfonamide::N-[2-(3-chloro-4-methoxyphenyl)-2H-1,2,3-benzotriazol-5-yl]methanesulfonamide::N-[2-(3-chloro-4-methoxyphenyl)-5-benzotriazolyl]methanesulfonamide::N-[2-(3-chloro-4-methoxyphenyl)benzotriazol-5-yl]methanesulfonamide::SMR000074427::cid_1091853
SMILES COc1ccc(cc1Cl)-n1nc2ccc(NS(C)(=O)=O)cc2n1
InChI Key InChIKey=GKBSHHHDAPJWJO-UHFFFAOYSA-N
Data  5 EC50
  Tab Delimited (TSV)   2D SDfile   Computed 3D by Vconf -m prep SDfile
Find this compound or compounds like it in BindingDB:
Activity Spreadsheet -- Enzyme Inhibition Constant Data from BindingDB
Found 5 hits for monomerid = 37109
TargetSphingosine 1-phosphate receptor 1(Homo sapiens (Human))
The Scripps Research Institute Molecular Screening Center
Curated by PubChem BioAssay
LigandPNGBDBM37109(MLS000049114 | N-[2-(3-chloranyl-4-methoxy-phenyl)...)
Affinity DataEC50:  126nM. Assay description: Source (MLSCN Center Name): The Scripps Research Institute Molecular Screening Center Center Affiliation: The Scripps Research Institute, TSRI Assay ...
In DepthDetails PCBioAssay
TargetSphingosine 1-phosphate receptor 1(Homo sapiens (Human))
The Scripps Research Institute Molecular Screening Center
Curated by PubChem BioAssay
LigandPNGBDBM37109(MLS000049114 | N-[2-(3-chloranyl-4-methoxy-phenyl)...)
Affinity DataEC50: >9.51E+4nM. Assay description: Source (MLSCN Center Name): The Scripps Research Institute Molecular Screening Center Center Affiliation: The Scripps Research Institute, TSRI Assay ...
In DepthDetails PCBioAssay
TargetNeuropeptide Y receptor type 2(Homo sapiens (Human))
The Scripps Research Institute Molecular Screening Center
Curated by PubChem BioAssay
LigandPNGBDBM37109(MLS000049114 | N-[2-(3-chloranyl-4-methoxy-phenyl)...)
Affinity DataEC50:  3.54E+4nM. Assay description: Source (MLPCN Center Name): The Scripps Research Institute Molecular Screening Center (SRIMSC) Center Affiliation: The Scripps Research Institute (TS...
In DepthDetails PCBioAssay
TargetNeuropeptide Y receptor type 1(Homo sapiens (Human))
The Scripps Research Institute Molecular Screening Center
Curated by PubChem BioAssay
LigandPNGBDBM37109(MLS000049114 | N-[2-(3-chloranyl-4-methoxy-phenyl)...)
Affinity DataEC50:  3.54E+4nM. Assay description: Source (MLPCN Center Name): The Scripps Research Institute Molecular Screening Center (SRIMSC) Center Affiliation: The Scripps Research Institute (TS...
In DepthDetails PCBioAssay
TargetSphingosine 1-phosphate receptor 1(Homo sapiens (Human))
The Scripps Research Institute Molecular Screening Center
Curated by PubChem BioAssay
LigandPNGBDBM37109(MLS000049114 | N-[2-(3-chloranyl-4-methoxy-phenyl)...)
Affinity DataEC50:  148nM. Assay description: Source (MLSCN Center Name): The Scripps Research Institute Molecular Screening Center Center Affiliation: The Scripps Research Institute, TSRI Assay ...
In DepthDetails PCBioAssay