BDBM37376 MLS000042779::N-[1,3-benzothiazol-2-ylimino-(1-oxopropylamino)methyl]propanamide::N-[N'-(1,3-benzothiazol-2-yl)-N-propanoyl-carbamimidoyl]propanamide::N-[N'-(1,3-benzothiazol-2-yl)-N-propanoylcarbamimidoyl]propanamide::N-[N'-(1,3-benzothiazol-2-yl)-N-propionyl-amidino]propionamide::SMR000037266::cid_662345
SMILES [#6]-[#6]-[#6](=O)-[#7]\[#6](-[#7]-[#6](=O)-[#6]-[#6])=[#7]\c1nc2ccccc2s1
InChI Key InChIKey=WQUITCPFPXMADZ-UHFFFAOYSA-N
Data  1 IC50  2 EC50
  Tab Delimited (TSV)   2D SDfile   Computed 3D by Vconf -m prep SDfile
Find this compound or compounds like it in BindingDB:
Activity Spreadsheet -- Enzyme Inhibition Constant Data from BindingDB
Found 3 hits for monomerid = 37376
TargetSphingosine 1-phosphate receptor 3(Homo sapiens (Human))
The Scripps Research Institute Molecular Screening Center
Curated by PubChem BioAssay
LigandPNGBDBM37376(MLS000042779 | N-[1,3-benzothiazol-2-ylimino-(1-ox...)
Affinity DataIC50: >4.98E+4nM. Assay description: Source (MLSCN Center Name): The Scripps Research Institute Molecular Screening Center Center Affiliation: The Scripps Research Institute, TSRI Assay ...
In DepthDetails PCBioAssay
TargetTranscription factor p65(Homo sapiens (Human))
Srmlsc
Curated by PubChem BioAssay
LigandPNGBDBM37376(MLS000042779 | N-[1,3-benzothiazol-2-ylimino-(1-ox...)
Affinity DataEC50:  4.45E+3nM. Assay description: Southern Research Molecular Libraries Screening Center (SRMLSC) Southern Research Institute (Birmingham, Alabama) NIH Molecular Libraries Screening C...
In DepthDetails PCBioAssay
TargetD(1B) dopamine receptor(Homo sapiens (Human))
Vanderbilt Screening Center For Gpcrs, Ion Channels And Transporters
Curated by PubChem BioAssay
LigandPNGBDBM37376(MLS000042779 | N-[1,3-benzothiazol-2-ylimino-(1-ox...)
Affinity DataEC50:  0.00190nM. Assay description: Assay Provider: Val Watts Assay Provider Affiliation: Purdue University Grant Title: Allosteric Modulators of D1 Receptors Grant Number: 1 X01 MH0776...
In DepthDetails PCBioAssay