BDBM37472 1-(1-phenylcyclopropyl)-3-(3-pyridinylmethyl)urea::1-(1-phenylcyclopropyl)-3-(3-pyridylmethyl)urea::1-(1-phenylcyclopropyl)-3-(pyridin-3-ylmethyl)urea::MLS000119106::SMR000096044::cid_674439
SMILES O=C(NCc1cccnc1)NC1(CC1)c1ccccc1
InChI Key InChIKey=DTCMZCRTIGCWHT-UHFFFAOYSA-N
Data  1 IC50
  Tab Delimited (TSV)   2D SDfile   Computed 3D by Vconf -m prep SDfile
Find this compound or compounds like it in BindingDB:
Activity Spreadsheet -- Enzyme Inhibition Constant Data from BindingDB
Found 1 hit for monomerid = 37472
TargetSphingosine 1-phosphate receptor 3(Homo sapiens (Human))
The Scripps Research Institute Molecular Screening Center
Curated by PubChem BioAssay
LigandPNGBDBM37472(1-(1-phenylcyclopropyl)-3-(3-pyridinylmethyl)urea ...)
Affinity DataIC50: >4.98E+4nM. Assay description: Source (MLSCN Center Name): The Scripps Research Institute Molecular Screening Center Center Affiliation: The Scripps Research Institute, TSRI Assay ...
In DepthDetails PCBioAssay