BDBM374788 US10246467, Example I-107::US10919913, # I-107
SMILES OC(=O)c1cc2nn3[C@@H]4[C@H](COc3c2cc1F)N(CC1CC1)[C@]1([C@H]4c2cccc(Cl)c2F)C(=O)Nc2cc(Cl)ccc12
InChI Key InChIKey=WSHHPNWMQUMLND-HLNVOFQHSA-N
Data  2 IC50
  Tab Delimited (TSV)   2D SDfile   Computed 3D by Vconf -m prep SDfile
Find this compound or compounds like it in BindingDB:
Activity Spreadsheet -- Enzyme Inhibition Constant Data from BindingDB
Found 2 hits for monomerid = 374788
TargetE3 ubiquitin-protein ligase Mdm2(Homo sapiens (Human))
Boehringer Ingelheim International
US Patent
LigandPNGBDBM374788(US10246467, Example I-107 | US10919913, # I-107)
Affinity DataIC50:  18nM. Assay description: This assay is used to determine whether the compounds inhibit the p53-MDM2 interaction and thus restore p53 function.15 μL of compound in 20% DM...
Ligand InfoPC cidPC sid
In DepthDetails US Patent
TargetCellular tumor antigen p53 [16-27]/E3 ubiquitin-protein ligase Mdm2 [23-117](Homo sapiens (Human))
Boehringer Ingelheim International
US Patent
LigandPNGBDBM374788(US10246467, Example I-107 | US10919913, # I-107)
Affinity DataIC50:  18nM. Assay description: This assay is used to determine whether the compounds inhibit the p53-MDM2 interaction and thus restore p53 function.15 μL of compound in 20% DM...
Ligand InfoPC cidPC sid
In DepthDetails US Patent