BDBM37569 4-(4-acetoxy-3-methoxy-phenyl)-2-(acetylthio)-6-methyl-1,4-dihydropyrimidine-5-carboxylic acid ethyl ester::4-(4-acetyloxy-3-methoxyphenyl)-2-(acetylthio)-6-methyl-1,4-dihydropyrimidine-5-carboxylic acid ethyl ester::MLS000085779::SMR000020908::cid_3243459::ethyl 4-(4-acetyloxy-3-methoxy-phenyl)-2-ethanoylsulfanyl-6-methyl-1,4-dihydropyrimidine-5-carboxylate::ethyl 4-(4-acetyloxy-3-methoxyphenyl)-2-acetylsulfanyl-6-methyl-1,4-dihydropyrimidine-5-carboxylate::ethyl 4-[4-(acetyloxy)-3-methoxyphenyl]-2-(acetylthio)-6-methyl-1,4-dihydropyrimidine-5-carboxylate
SMILES CCOC(=O)C1C(N=C(SC(C)=O)N=C1C)c1ccc(OC(C)=O)c(OC)c1
InChI Key InChIKey=HGBPMSKCPDVISE-UHFFFAOYSA-N
Data  1 IC50
  Tab Delimited (TSV)   2D SDfile   Computed 3D by Vconf -m prep SDfile
Find this compound or compounds like it in BindingDB:
Activity Spreadsheet -- Enzyme Inhibition Constant Data from BindingDB
Found 1 hit for monomerid = 37569
TargetHuntingtin(Homo sapiens (Human))
Columbia University Molecular Screening Center
Curated by PubChem BioAssay
LigandPNGBDBM37569(4-(4-acetoxy-3-methoxy-phenyl)-2-(acetylthio)-6-me...)
Affinity DataIC50: >8.00E+3nM. Assay description: The mutation underlying Huntington's disease is an expansion of a polyglutamine tract in the N-terminus of the protein huntingtin (htt). Under no...
Ligand InfoKEGGPC cidPC sid
In DepthDetails PCBioAssay