BDBM37699 MLS000094738::N-cyclopentyl-5-keto-1-thioxo-4H-thiazolo[3,4-a]quinazoline-3-carboxamide::N-cyclopentyl-5-oxidanylidene-1-sulfanylidene-4H-[1,3]thiazolo[3,4-a]quinazoline-3-carboxamide::N-cyclopentyl-5-oxo-1-sulfanylidene-4H-[1,3]thiazolo[3,4-a]quinazoline-3-carboxamide::N-cyclopentyl-5-oxo-1-sulfanylidene-4H-thiazolo[3,4-a]quinazoline-3-carboxamide::N-cyclopentyl-5-oxo-1-thioxo-4,5-dihydro[1,3]thiazolo[3,4-a]quinazoline-3-carboxamide::SMR000030291::cid_3237505
SMILES O=C(NC1CCCC1)c1sc(=S)n2c1[nH]c(=O)c1ccccc21
InChI Key InChIKey=NUKSLNMWIXAEOB-UHFFFAOYSA-N
Data  2 KI  4 IC50  1 EC50
  Tab Delimited (TSV)   2D SDfile   Computed 3D by Vconf -m prep SDfile
Find this compound or compounds like it in BindingDB:
Activity Spreadsheet -- Enzyme Inhibition Constant Data from BindingDB
Found 7 hits for monomerid = 37699
TargetfMet-Leu-Phe receptor(Homo sapiens (Human))
Nmmlsc
Curated by PubChem BioAssay
LigandPNGBDBM37699(MLS000094738 | N-cyclopentyl-5-keto-1-thioxo-4H-th...)
Affinity DataKi:  9.60E+3nM. Assay description: University of New Mexico Assay Overview: Assay Support: NIH 1R03MH076381-01 Assay for Formylpeptide Receptor Family Ligands PI: Bruce S. Edwards, Ph...
In DepthDetails PCBioAssay
TargetN-formyl peptide receptor 2(Homo sapiens (Human))
Nmmlsc
Curated by PubChem BioAssay
LigandPNGBDBM37699(MLS000094738 | N-cyclopentyl-5-keto-1-thioxo-4H-th...)
Affinity DataKi: >4.03E+4nM. Assay description: University of New Mexico Assay Overview Assay Support: NIH 1R03MH076381-01 Assay for Formylpeptide Receptor Family Ligands PI: Bruce S. Edwards, Ph....
In DepthDetails PCBioAssay
TargetLarge T antigen(Simian virus 40)
Southern Research Specialized Biocontainment Screening Center
Curated by PubChem BioAssay
LigandPNGBDBM37699(MLS000094738 | N-cyclopentyl-5-keto-1-thioxo-4H-th...)
Affinity DataIC50:  1.00E+5nM. Assay description: A biochemical assay using the ADP-Hunter methodology, purified TAg, and ATP to identify compounds that inhibit the ATPase activity of Tag Southern Re...
In DepthDetails PCBioAssay
TargetLarge T antigen(Simian virus 40)
Southern Research Specialized Biocontainment Screening Center
Curated by PubChem BioAssay
LigandPNGBDBM37699(MLS000094738 | N-cyclopentyl-5-keto-1-thioxo-4H-th...)
Affinity DataEC50:  1.59E+4nM. Assay description: Southern Research's Specialized Biocontainment Screening Center (SRSBSC) Southern Research Institute (Birmingham, Alabama) NIH Molecular Librarie...
In DepthDetails PCBioAssay
TargetN-formyl peptide receptor 2(Homo sapiens (Human))
Nmmlsc
Curated by PubChem BioAssay
LigandPNGBDBM37699(MLS000094738 | N-cyclopentyl-5-keto-1-thioxo-4H-th...)
Affinity DataIC50: >6.67E+4nM. Assay description: University of New Mexico Assay Overview Assay Support: NIH 1R03MH076381-01 Assay for Formylpeptide Receptor Family Ligands PI: Bruce S. Edwards, Ph....
In DepthDetails PCBioAssay
TargetfMet-Leu-Phe receptor(Homo sapiens (Human))
Nmmlsc
Curated by PubChem BioAssay
LigandPNGBDBM37699(MLS000094738 | N-cyclopentyl-5-keto-1-thioxo-4H-th...)
Affinity DataIC50:  1.47E+4nM. Assay description: University of New Mexico Assay Overview: Assay Support: NIH 1R03MH076381-01 Assay for Formylpeptide Receptor Family Ligands PI: Bruce S. Edwards, Ph...
In DepthDetails PCBioAssay
TargetM1 family aminopeptidase(Plasmodium falciparum (isolate FcB1 / Columbia))
Srmlsc
Curated by PubChem BioAssay
LigandPNGBDBM37699(MLS000094738 | N-cyclopentyl-5-keto-1-thioxo-4H-th...)
Affinity DataIC50:  3.50E+4nM. Assay description: Southern Research Molecular Libraries Screening Center (SRMLSC) Southern Research Institute (Birmingham, Alabama) NIH Molecular Libraries Screening...
In DepthDetails PCBioAssay