BDBM377750 5-amino-1-(1-cyanopiperidin-3-yl)- 3-[4-(4- isopropoxyphenoxy)phenyl]-1H- pyrazole-4-carboxamide::US10266513, Example 44::US10815213, Example 44
SMILES CC(C)Oc1ccc(Oc2ccc(cc2)-c2nn(C3CCCN(C3)C#N)c(N)c2C(N)=O)cc1
InChI Key InChIKey=HPGXQTBBPGYCPV-UHFFFAOYSA-N
Data  2 IC50
  Tab Delimited (TSV)   2D SDfile   Computed 3D by Vconf -m prep SDfile
Find this compound or compounds like it in BindingDB:
Activity Spreadsheet -- Enzyme Inhibition Constant Data from BindingDB
Found 2 hits for monomerid = 377750
TargetTyrosine-protein kinase BTK(Homo sapiens (Human))
Pfizer
US Patent
LigandPNGBDBM377750(5-amino-1-(1-cyanopiperidin-3-yl)- 3-[4-(4- isopro...)
Affinity DataIC50:  24.4nM. Assay description: BTK: TR-FRET LanthaScreen assays were performed by incubating a dilution series of inhibitor concentrations with 50 μM ATP, 100 nM FAM-Srctide p...
Ligand InfoPC cidPC sid
In DepthDetails US Patent
TargetTyrosine-protein kinase BTK(Homo sapiens (Human))
Pfizer
US Patent
LigandPNGBDBM377750(5-amino-1-(1-cyanopiperidin-3-yl)- 3-[4-(4- isopro...)
Affinity DataIC50:  24.4nM. Assay description: TR-FRET LanthaScreen assays were performed by incubating a dilution series of inhibitor concentrations with 50 μM ATP, 100 nM FAM-Srctide peptid...
Ligand InfoPC cidPC sid
In DepthDetails US Patent