BDBM377866 5-amino-3-{4-[(5-chloropyridin-2-yl)oxy]phenyl}-1-{(3R)-1-[(2E)-4,4-difluorobut-2-enoyl]piperidin-3-yl}-1H-pyrazole-4-carboxamide::US10266513, Example 160::US10815213, Example 160
SMILES NC(=O)c1c(N)n(nc1-c1ccc(Oc2ccc(Cl)cn2)cc1)C1CCCN(C1)C(=O)\C=C\CF
InChI Key InChIKey=LXSBUVPAJOBMGO-DAFODLJHSA-N
Data  4 IC50
  Tab Delimited (TSV)   2D SDfile   Computed 3D by Vconf -m prep SDfile
Find this compound or compounds like it in BindingDB:
Activity Spreadsheet -- Enzyme Inhibition Constant Data from BindingDB
Found 4 hits for monomerid = 377866
TargetTyrosine-protein kinase BTK(Homo sapiens (Human))
Pfizer
US Patent
LigandPNGBDBM377866(5-amino-3-{4-[(5-chloropyridin-2-yl)oxy]phenyl}-1-...)
Affinity DataIC50:  5.5nM. Assay description: TR-FRET LanthaScreen assays were performed by incubating a dilution series of inhibitor concentrations with 50 μM ATP, 100 nM FAM-Srctide peptid...
Ligand InfoPC cidPC sid
In DepthDetails US Patent
TargetEpidermal growth factor receptor(Homo sapiens (Human))
Pfizer
US Patent
LigandPNGBDBM377866(5-amino-3-{4-[(5-chloropyridin-2-yl)oxy]phenyl}-1-...)
Affinity DataIC50:  890nM. Assay description: EGFR: TR-FRET LanthaScreen assays were performed by incubating a dilution series of inhibitor concentrations with 20 μM ATP, 100 nM peptide subs...
Ligand InfoPC cidPC sid
In DepthDetails US Patent
TargetTyrosine-protein kinase BTK(Homo sapiens (Human))
Pfizer
US Patent
LigandPNGBDBM377866(5-amino-3-{4-[(5-chloropyridin-2-yl)oxy]phenyl}-1-...)
Affinity DataIC50:  5.5nM. Assay description: BTK: TR-FRET LanthaScreen assays were performed by incubating a dilution series of inhibitor concentrations with 50 μM ATP, 100 nM FAM-Srctide p...
Ligand InfoPC cidPC sid
In DepthDetails US Patent
TargetEpidermal growth factor receptor(Homo sapiens (Human))
Pfizer
US Patent
LigandPNGBDBM377866(5-amino-3-{4-[(5-chloropyridin-2-yl)oxy]phenyl}-1-...)
Affinity DataIC50:  890nM. Assay description: TR-FRET LanthaScreen assays were performed by incubating a dilution series of inhibitor concentrations with 20 μM ATP, 100 nM peptide substrate ...
Ligand InfoPC cidPC sid
In DepthDetails US Patent