BDBM37861 2-thiophenecarboxylic acid [1-(4-methylphenyl)sulfonyl-3-pyrazolyl] ester::PC-0094942::PCMD-CC-MCM-24::[1-(4-methylphenyl)sulfonylpyrazol-3-yl] thiophene-2-carboxylate::cid_11834389::thiophene-2-carboxylic acid (1-tosylpyrazol-3-yl) ester
SMILES Cc1ccc(cc1)S(=O)(=O)n1ccc(OC(=O)c2cccs2)n1
InChI Key InChIKey=RFFHSBOCCUWNEY-UHFFFAOYSA-N
Data  3 IC50
  Tab Delimited (TSV)   2D SDfile   Computed 3D by Vconf -m prep SDfile
Find this compound or compounds like it in BindingDB:
Activity Spreadsheet -- Enzyme Inhibition Constant Data from BindingDB
Found 3 hits for monomerid = 37861
TargetCathepsin B(Homo sapiens (Human))
Pcmd
Curated by PubChem BioAssay
LigandPNGBDBM37861(2-thiophenecarboxylic acid [1-(4-methylphenyl)sulf...)
Affinity DataIC50:  3.31E+4nM. Assay description: Human liver cathepsin B (EC 3.4.22.1) is a lysosomal cysteine protease. There has been a recent resurgence of interest in cathepsin B due to research...
In DepthDetails PCBioAssay
TargetSUMO-activating enzyme subunit 1(Homo sapiens (Human))
Burnham Center For Chemical Genomics
Curated by PubChem BioAssay
LigandPNGBDBM37861(2-thiophenecarboxylic acid [1-(4-methylphenyl)sulf...)
Affinity DataIC50:  9.48E+4nM. Assay description: Data Source: Sanford-Burnham Center for Chemical Genomics (SBCCG) Source Affiliation: Sanford-Burnham Medical Research Institute (SBMRI, San Diego, C...
In DepthDetails PCBioAssay
TargetSUMO-conjugating enzyme UBC9(Homo sapiens (Human))
Burnham Center For Chemical Genomics
Curated by PubChem BioAssay
LigandPNGBDBM37861(2-thiophenecarboxylic acid [1-(4-methylphenyl)sulf...)
Affinity DataIC50:  3.61E+3nM. Assay description: Data Source: Sanford-Burnham Center for Chemical Genomics (SBCCG) Source Affiliation: Sanford-Burnham Medical Research Institute (SBMRI, San Diego, C...
In DepthDetails PCBioAssay