BDBM37906 4-(7H-purin-6-ylamino)benzoic acid ethyl ester::MLS000086547::SMR000022442::cid_692130::ethyl 4-(7H-purin-6-ylamino)benzoate::ethyl 4-(9H-purin-6-ylamino)benzoate
SMILES CCOC(=O)c1ccc(Nc2ncnc3nc[nH]c23)cc1
InChI Key InChIKey=IFFPISAEZRPXHT-UHFFFAOYSA-N
Data  1 IC50  1 EC50
  Tab Delimited (TSV)   2D SDfile   Computed 3D by Vconf -m prep SDfile
Find this compound or compounds like it in BindingDB:
Activity Spreadsheet -- Enzyme Inhibition Constant Data from BindingDB
Found 2 hits for monomerid = 37906
TargetHeat shock factor protein 1(Mus musculus)
Broad Institute
Curated by PubChem BioAssay
LigandPNGBDBM37906(4-(7H-purin-6-ylamino)benzoic acid ethyl ester | M...)
Affinity DataEC50: >1.95E+5nM. Assay description: Keywords: Heat Shock Factor-1 (HSF-1), Stress Response, MG132, NIH3T3, Luminescence Assay Overview: Modified NIH3T3, transformed to express firefly...
In DepthDetails PCBioAssay
TargetcAMP-dependent protein kinase catalytic subunit alpha(Homo sapiens (Human))
The Scripps Research Institute Molecular Screening Center
Curated by PubChem BioAssay
LigandPNGBDBM37906(4-(7H-purin-6-ylamino)benzoic acid ethyl ester | M...)
Affinity DataIC50: >5.96E+4nM. Assay description: Source (MLSCN Center Name): The Scripps Research Institute Molecular Screening Center Center Affiliation: The Scripps Research Institute, TSRI Assay ...
In DepthDetails PCBioAssay