BDBM37938 1-amino-5-(1-piperidinyl)-6,7,8,9-tetrahydrothieno[2,3-c]isoquinoline-2-carboxamide::1-amino-5-piperidin-1-yl-6,7,8,9-tetrahydrothieno[2,3-c]isoquinoline-2-carboxamide::1-amino-5-piperidino-6,7,8,9-tetrahydrothien[2,3-c]isoquinoline-2-carboxamide::1-azanyl-5-piperidin-1-yl-6,7,8,9-tetrahydrothieno[2,3-c]isoquinoline-2-carboxamide::MLS000111104::SMR000107031::cid_2893957
SMILES NC(=O)c1sc2nc(N3CCCCC3)c3CCCCc3c2c1N
InChI Key InChIKey=IDNOXGMSHPHHRF-UHFFFAOYSA-N
Data  2 IC50
  Tab Delimited (TSV)   2D SDfile   Computed 3D by Vconf -m prep SDfile
Find this compound or compounds like it in BindingDB:
Activity Spreadsheet -- Enzyme Inhibition Constant Data from BindingDB
Found 2 hits for monomerid = 37938
TargetRho-associated protein kinase 2(Homo sapiens (Human))
The Scripps Research Institute Molecular Screening Center
Curated by PubChem BioAssay
LigandPNGBDBM37938(1-amino-5-(1-piperidinyl)-6,7,8,9-tetrahydrothieno...)
Affinity DataIC50:  1.43E+5nM. Assay description: Source (MLSCN Center Name): The Scripps Research Institute Molecular Screening Center Center Affiliation: The Scripps Research Institute, TSRI Assay ...
In DepthDetails PCBioAssay
TargetcAMP-dependent protein kinase catalytic subunit alpha(Homo sapiens (Human))
The Scripps Research Institute Molecular Screening Center
Curated by PubChem BioAssay
LigandPNGBDBM37938(1-amino-5-(1-piperidinyl)-6,7,8,9-tetrahydrothieno...)
Affinity DataIC50:  3.58E+5nM. Assay description: Source (MLSCN Center Name): The Scripps Research Institute Molecular Screening Center Center Affiliation: The Scripps Research Institute, TSRI Assay ...
In DepthDetails PCBioAssay