BDBM38117 1-acetyl-N-(1,2,3,4-tetrahydronaphthalen-1-yl)-2,3-dihydroindole-5-sulfonamide::1-acetyl-N-1,2,3,4-tetrahydronaphthalen-1-ylindoline-5-sulfonamide::1-acetyl-N-tetralin-1-yl-indoline-5-sulfonamide::1-ethanoyl-N-(1,2,3,4-tetrahydronaphthalen-1-yl)-2,3-dihydroindole-5-sulfonamide::MLS000091499::SMR000026054::cid_3240386
SMILES CC(=O)N1CCc2cc(ccc12)S(=O)(=O)NC1CCCc2ccccc12
InChI Key InChIKey=BJRDSGROVGTIMG-UHFFFAOYSA-N
Data  2 IC50
  Tab Delimited (TSV)   2D SDfile   Computed 3D by Vconf -m prep SDfile
Find this compound or compounds like it in BindingDB:
Activity Spreadsheet -- Enzyme Inhibition Constant Data from BindingDB
Found 2 hits for monomerid = 38117
TargetSignal transducer and activator of transcription 1-alpha/beta(Homo sapiens (Human))
The Scripps Research Institute Molecular Screening Center
Curated by PubChem BioAssay
LigandPNGBDBM38117(1-acetyl-N-(1,2,3,4-tetrahydronaphthalen-1-yl)-2,3...)
Affinity DataIC50: >5.57E+4nM. Assay description: Source (MLPCN Center Name): The Scripps Research Institute Molecular Screening Center Center Affiliation: The Scripps Research Institute (TSRI) Assay...
In DepthDetails PCBioAssay
TargetSignal transducer and activator of transcription 3 [702-738,740-752](Homo sapiens (Human))
The Scripps Research Institute Molecular Screening Center
Curated by PubChem BioAssay
LigandPNGBDBM38117(1-acetyl-N-(1,2,3,4-tetrahydronaphthalen-1-yl)-2,3...)
Affinity DataIC50:  5.12E+3nM. Assay description: Source (MLPCN Center Name): The Scripps Research Institute Molecular Screening Center Center Affiliation: The Scripps Research Institute (TSRI) Assay...
In DepthDetails PCBioAssay