BDBM38345 MLS000084527::SMR000048040::cid_666765
SMILES Cc1nc2oc3c(NCC4CCCO4)ncnc3c2c2CC(C)(C)OCc12
InChI Key InChIKey=MLLIYHMCHJFJJJ-UHFFFAOYSA-N
Data  1 IC50
  Tab Delimited (TSV)   2D SDfile   Computed 3D by Vconf -m prep SDfile
Find this compound or compounds like it in BindingDB:
Activity Spreadsheet -- Enzyme Inhibition Constant Data from BindingDB
Found 1 hit for monomerid = 38345
TargetDiphosphomevalonate decarboxylase(Streptococcus pneumoniae D39)
Srmlsc
Curated by PubChem BioAssay
LigandPNGBDBM38345(MLS000084527 | SMR000048040 | cid_666765)
Affinity DataIC50:  2.23E+4nM. Assay description: Southern Research Molecular Libraries Screening Center (SRMLSC) Southern Research Institute (Birmingham, Alabama) NIH Molecular Libraries Screening C...
In DepthDetails PCBioAssay