BDBM384138 1-(3-(2-chloro-3- fluorophenyl)-1H- pyrazolo[3,4-b]- pyrazin-6-yl)-4- methyl-piperidin-4- amine::US10280171, Example 24::US10851110, Example 24::US11466017, Example 24
SMILES CC1(N)CCN(CC1)c1cnc2c(n[nH]c2n1)-c1cccc(F)c1Cl
InChI Key InChIKey=QKNOZCPUZKQEHX-UHFFFAOYSA-N
Data  4 IC50
  Tab Delimited (TSV)   2D SDfile   Computed 3D by Vconf -m prep SDfile
Find this compound or compounds like it in BindingDB:
Activity Spreadsheet -- Enzyme Inhibition Constant Data from BindingDB
Found 4 hits for monomerid = 384138
TargetTyrosine-protein phosphatase non-receptor type 11 [E76K](Homo sapiens (Human))
The University Of Texas System
US Patent
LigandPNGBDBM384138(1-(3-(2-chloro-3- fluorophenyl)-1H- pyrazolo[3,4-b...)
Affinity DataIC50:  204nM. Assay description: Recombinant full-length wild-type and E76K mutant human PTPN11 proteins were cloned, expressed (E. coli system), and isolated via a two-step purifica...
Ligand InfoPC cidPC sid
In DepthDetails US Patent
TargetTyrosine-protein phosphatase non-receptor type 11 [E76K](Homo sapiens (Human))
The University Of Texas System
US Patent
LigandPNGBDBM384138(1-(3-(2-chloro-3- fluorophenyl)-1H- pyrazolo[3,4-b...)
Affinity DataIC50:  204nM. Assay description: Phosphatase activity of full length wild-type PTPN11(PTPN11-WT) or PTPN11-E76K mutant enzyme was measured using the fluorogenic 6,8-difluoro-4-methyl...
Ligand InfoPC cidPC sid
In DepthDetails US Patent
TargetTyrosine-protein phosphatase non-receptor type 11 [E76K](Homo sapiens (Human))
The University Of Texas System
US Patent
LigandPNGBDBM384138(1-(3-(2-chloro-3- fluorophenyl)-1H- pyrazolo[3,4-b...)
Affinity DataIC50:  204nM. Assay description: Recombinant full-length wild-type and E76K mutant human PTPN11 proteins were cloned, expressed (E. coli system), and isolated via a two-step purifica...
Ligand InfoPC cidPC sid
In DepthDetails US Patent
TargetEukaryotic translation initiation factor 2-alpha kinase 3(Homo sapiens (Human))
The University Of Texas System
US Patent
LigandPNGBDBM384138(1-(3-(2-chloro-3- fluorophenyl)-1H- pyrazolo[3,4-b...)
Affinity DataIC50:  142nM. Assay description: KYSE-520 cells (10 k cells/well) were grown in 384-well plate in 20 uL of medium (RPMI-1640, without phenol red, containing 10% FBS) at 37° C. with 5...
Ligand InfoPC cidPC sid
In DepthDetails US Patent