BDBM386534 (2S,4R)-1-(2-(3- acetyl-5-(2- methylpyrimidin- 5-yl)-1H-indazol- 1-yl)acetyl)-4- fluoro-N-(2- fluoro-3- methylbut-2-en-1- yl)pyrrolidine-2- carboxamide::US10287301, Compound 474::US10822352, Comp No. 474
SMILES [#6]\[#6](-[#6])=[#6](\F)-[#6]-[#7]-[#6](=O)-[#6@@H]-1-[#6]-[#6@@H](F)-[#6]-[#7]-1-[#6](=O)-[#6]-n1nc(-[#6](-[#6])=O)c2cc(ccc12)-c1cnc(-[#6])nc1
InChI Key InChIKey=QMXAYJXMGFTFFW-XXBNENTESA-N
Data  2 IC50
  Tab Delimited (TSV)   2D SDfile   Computed 3D by Vconf -m prep SDfile
Find this compound or compounds like it in BindingDB:
Activity Spreadsheet -- Enzyme Inhibition Constant Data from BindingDB
Found 2 hits for monomerid = 386534
TargetComplement factor D(Homo sapiens (Human))
Achillion Pharmaceuticals
US Patent
LigandPNGBDBM386534((2S,4R)-1-(2-(3- acetyl-5-(2- methylpyrimidin- 5-y...)
Affinity DataIC50: <1.00E+3nM. Assay description: Human Factor D (purified from human serum, Complement Technology, Inc.) at 80 nM final concentration was incubated with test compound at various conc...
Ligand InfoPC cidPC sid
In DepthDetails US Patent
TargetComplement factor D(Homo sapiens (Human))
Achillion Pharmaceuticals
US Patent
LigandPNGBDBM386534((2S,4R)-1-(2-(3- acetyl-5-(2- methylpyrimidin- 5-y...)
Affinity DataIC50: <1.00E+3nM. Assay description: Human Factor D (purified from human serum, Complement Technology, Inc.) at 80 nM final concentration was incubated with test compound at various conc...
Ligand InfoPC cidPC sid
In DepthDetails US Patent