BDBM38741 1-[(3-methyl-2-thienyl)methyl]-4-(2-pyridyl)piperazine::1-[(3-methyl-2-thiophenyl)methyl]-4-(2-pyridinyl)piperazine::1-[(3-methylthiophen-2-yl)methyl]-4-pyridin-2-yl-piperazine::1-[(3-methylthiophen-2-yl)methyl]-4-pyridin-2-ylpiperazine::MLS000105270::SMR000102151::cid_792508
SMILES Cc1ccsc1CN1CCN(CC1)c1ccccn1
InChI Key InChIKey=SIAQFVIRDNTJBR-UHFFFAOYSA-N
Data  3 IC50  2 EC50
  Tab Delimited (TSV)   2D SDfile   Computed 3D by Vconf -m prep SDfile
Find this compound or compounds like it in BindingDB:
Activity Spreadsheet -- Enzyme Inhibition Constant Data from BindingDB
Found 5 hits for monomerid = 38741
TargetMevalonate kinase(Streptococcus pneumoniae D39)
Srmlsc
Curated by PubChem BioAssay
LigandPNGBDBM38741(1-[(3-methyl-2-thienyl)methyl]-4-(2-pyridyl)pipera...)
Affinity DataIC50: >1.00E+7nM. Assay description: Southern Research Molecular Libraries Screening Center (SRMLSC) Southern Research Institute (Birmingham, Alabama) NIH Molecular Libraries Screening C...
In DepthDetails PCBioAssay
TargetMevalonate kinase(Streptococcus pneumoniae D39)
Srmlsc
Curated by PubChem BioAssay
LigandPNGBDBM38741(1-[(3-methyl-2-thienyl)methyl]-4-(2-pyridyl)pipera...)
Affinity DataIC50: >1.00E+7nM. Assay description: Southern Research Molecular Libraries Screening Center (SRMLSC) Southern Research Institute (Birmingham, Alabama) NIH Molecular Libraries Screening C...
In DepthDetails PCBioAssay
Target5-hydroxytryptamine receptor 2A(Mus musculus (Mouse))
The Scripps Research Institute Molecular Screening Center
Curated by PubChem BioAssay
LigandPNGBDBM38741(1-[(3-methyl-2-thienyl)methyl]-4-(2-pyridyl)pipera...)
Affinity DataEC50:  7.61E+4nM. Assay description: Source (MLPCN Center Name): The Scripps Research Institute Molecular Screening Center (SRIMSC) Affiliation: The Scripps Research Institute, TSRI Assa...
In DepthDetails PCBioAssay
TargetMu-type opioid receptor(Homo sapiens (Human))
The Scripps Research Institute Molecular Screening Center
Curated by PubChem BioAssay
LigandPNGBDBM38741(1-[(3-methyl-2-thienyl)methyl]-4-(2-pyridyl)pipera...)
Affinity DataEC50:  9.25E+4nM. Assay description: Source (MLPCN Center Name): The Scripps Research Institute Molecular Screening Center (SRIMSC) Assay Provider: Laura Bohn External Assay ID: OPRM1_AC...
In DepthDetails PCBioAssay
TargetMevalonate kinase(Streptococcus pneumoniae D39)
Srmlsc
Curated by PubChem BioAssay
LigandPNGBDBM38741(1-[(3-methyl-2-thienyl)methyl]-4-(2-pyridyl)pipera...)
Affinity DataIC50: >1.00E+7nM. Assay description: Southern Research Molecular Libraries Screening Center (SRMLSC) Southern Research Institute (Birmingham, Alabama) NIH Molecular Libraries Screening C...
In DepthDetails PCBioAssay