BDBM38840 MLS000118476::N-(2-furanylmethyl)-3-methyl-2-[(2-methyl-1,3-benzothiazol-6-yl)sulfonylamino]butanamide::N-(2-furfuryl)-3-methyl-2-[(2-methyl-1,3-benzothiazol-6-yl)sulfonylamino]butyramide::N-(furan-2-ylmethyl)-3-methyl-2-[(2-methyl-1,3-benzothiazol-6-yl)sulfonylamino]butanamide::SMR000095417::cid_5309266
SMILES CC(C)C(NS(=O)(=O)c1ccc2nc(C)sc2c1)C(=O)NCc1ccco1
InChI Key InChIKey=VJYZGFYURNHQAA-UHFFFAOYSA-N
Data  2 IC50
  Tab Delimited (TSV)   2D SDfile   Computed 3D by Vconf -m prep SDfile
Find this compound or compounds like it in BindingDB:
Activity Spreadsheet -- Enzyme Inhibition Constant Data from BindingDB
Found 2 hits for monomerid = 38840
TargetNeutrophil cytosol factor 1 [S99G](Homo sapiens (Human))
Emory University
Curated by PubChem BioAssay
LigandPNGBDBM38840(MLS000118476 | N-(2-furanylmethyl)-3-methyl-2-[(2-...)
Affinity DataIC50:  5.00E+4nM. Assay description: NIH Molecular Libraries Screening Centers Network [MLSCN] Emory Chemical Biology Discovery Center in MLSCN Assay provider: Susan Smith, Emory Univers...
In DepthDetails PCBioAssay
TargetM-phase inducer phosphatase 2(Homo sapiens (Human))
University Of Pittsburgh
Curated by PubChem BioAssay
LigandPNGBDBM38840(MLS000118476 | N-(2-furanylmethyl)-3-methyl-2-[(2-...)
Affinity DataIC50: >5.00E+4nM. Assay description: The Cdc25B Phosphatase HTS dose response confirmation has been developed to confirm actives identified in the Cdc25B HTS AID 368, screened at the Uni...
In DepthDetails PCBioAssay