BDBM388468 US9944618, Compound ID No. 2::US9944618, Compound ID No. 90
SMILES CNCC(Cc1ccccc1CO)c1ccc2ccccc2c1
InChI Key InChIKey=BUZAYDYQPINNKR-UHFFFAOYSA-N
Data  6 KI  4 IC50
  Tab Delimited (TSV)   2D SDfile   Computed 3D by Vconf -m prep SDfile
Find this compound or compounds like it in BindingDB:
Activity Spreadsheet -- Enzyme Inhibition Constant Data from BindingDB
Found 10 hits for monomerid = 388468
TargetSodium-dependent noradrenaline transporter(Homo sapiens (Human))
Mayo Foundation
US Patent
LigandPNGBDBM388468(US9944618, Compound ID No. 2 | US9944618, Compound...)
Affinity DataKi:  1nM. Assay description: NET: This protocol was designed to measure inhibition of uptake by the human norepinephrine transporter. The reagents were human NET (HEK293F) cells,...
Ligand InfoPC cidPC sid
In DepthDetails US Patent
TargetSodium-dependent serotonin transporter(Homo sapiens (Human))
Mayo Foundation
US Patent
LigandPNGBDBM388468(US9944618, Compound ID No. 2 | US9944618, Compound...)
Affinity DataKi:  2.5nM. Assay description: SERT: This protocol was designed to measure inhibition of uptake by the human serotonin transporter. The reagents were human SERT (HEK293F) cells, fl...
Ligand InfoPC cidPC sid
In DepthDetails US Patent
TargetSodium-dependent dopamine transporter(Homo sapiens (Human))
Mayo Foundation
US Patent
LigandPNGBDBM388468(US9944618, Compound ID No. 2 | US9944618, Compound...)
Affinity DataKi:  5.5nM. Assay description: DAT: This protocol was designed to measure inhibition of uptake by the human dopamine transporter. The reagents were human DAT (HEK293F) cells, GBR 1...
Ligand InfoPC cidPC sid
In DepthDetails US Patent
TargetSodium-dependent noradrenaline transporter(Homo sapiens (Human))
Mayo Foundation
US Patent
LigandPNGBDBM388468(US9944618, Compound ID No. 2 | US9944618, Compound...)
Affinity DataKi:  22.6nM. Assay description: NET: This protocol was designed to measure inhibition of uptake by the human norepinephrine transporter. The reagents were human NET (HEK293F) cells,...
Ligand InfoPC cidPC sid
In DepthDetails US Patent
TargetSodium-dependent serotonin transporter(Homo sapiens (Human))
Mayo Foundation
US Patent
LigandPNGBDBM388468(US9944618, Compound ID No. 2 | US9944618, Compound...)
Affinity DataKi:  25.4nM. Assay description: SERT: This protocol was designed to measure inhibition of uptake by the human serotonin transporter. The reagents were human SERT (HEK293F) cells, fl...
Ligand InfoPC cidPC sid
In DepthDetails US Patent
TargetSodium-dependent dopamine transporter(Homo sapiens (Human))
Mayo Foundation
US Patent
LigandPNGBDBM388468(US9944618, Compound ID No. 2 | US9944618, Compound...)
Affinity DataKi:  86.2nM. Assay description: DAT: This protocol was designed to measure inhibition of uptake by the human dopamine transporter. The reagents were human DAT (HEK293F) cells, GBR 1...
Ligand InfoPC cidPC sid
In DepthDetails US Patent
TargetPotassium voltage-gated channel subfamily H member 2(Homo sapiens (Human))
Mayo Foundation
US Patent
LigandPNGBDBM388468(US9944618, Compound ID No. 2 | US9944618, Compound...)
Affinity DataIC50:  1.20E+4nM. Assay description: HERG: The pre- and post-compound hERG current was evoked by a single voltage pulse consisting of a 20 s period holding at −70 mV, a 160 ms step...
Ligand InfoPC cidPC sid
In DepthDetails US Patent
TargetCytochrome P450 2D6(Homo sapiens (Human))
Mayo Foundation
US Patent
LigandPNGBDBM388468(US9944618, Compound ID No. 2 | US9944618, Compound...)
Affinity DataIC50:  590nM. Assay description: Cytochrome P450 3A4 and 2D6:Recombinant enzymes, 3A4 and 2D6, generated using the ABL yeast expression system were used. For CYP3A4, the enzyme amou...
Ligand InfoPC cidPC sid
In DepthDetails US Patent
TargetPotassium voltage-gated channel subfamily H member 2(Homo sapiens (Human))
Mayo Foundation
US Patent
LigandPNGBDBM388468(US9944618, Compound ID No. 2 | US9944618, Compound...)
Affinity DataIC50:  1.50E+4nM. Assay description: HERG: The pre- and post-compound hERG current was evoked by a single voltage pulse consisting of a 20 s period holding at −70 mV, a 160 ms step...
Ligand InfoPC cidPC sid
In DepthDetails US Patent
TargetCytochrome P450 2D6(Homo sapiens (Human))
Mayo Foundation
US Patent
LigandPNGBDBM388468(US9944618, Compound ID No. 2 | US9944618, Compound...)
Affinity DataIC50:  170nM. Assay description: Cytochrome P450 3A4 and 2D6:Recombinant enzymes, 3A4 and 2D6, generated using the ABL yeast expression system were used. For CYP3A4, the enzyme amou...
Ligand InfoPC cidPC sid
In DepthDetails US Patent