BDBM388949 5-{7-(4-cyanophenyl)-5-[4-(dimethylamino)piperidin-1-yl]imidazo[1,2-c]pyrimidin-8-yl}-2-methylnicotinonitrile::US10800779, Example 66::US11401272, Example 66::US9944647, Example 66
SMILES CN(C)C1CCN(CC1)c1nc(-c2ccc(cc2)C#N)c(-c2cnc(C)c(c2)C#N)c2nccn12
InChI Key InChIKey=IUEBHWAMGYBZCK-UHFFFAOYSA-N
Data  3 IC50
  Tab Delimited (TSV)   2D SDfile   Computed 3D by Vconf -m prep SDfile
Find this compound or compounds like it in BindingDB:
Activity Spreadsheet -- Enzyme Inhibition Constant Data from BindingDB
Found 3 hits for monomerid = 388949
TargetLysine-specific histone demethylase 1A(Homo sapiens (Human))
Incyte
US Patent
LigandPNGBDBM388949(5-{7-(4-cyanophenyl)-5-[4-(dimethylamino)piperidin...)
Affinity DataIC50:  275nM. Assay description: LANCE LSD1/KDM1A demethylase assay-10 μL of 1 nM LSD-1 enzyme (ENZO BML-SE544-0050) in the assay buffer (50 mM Tris, pH 7.5, 0.01% Tween-20, 25 ...
Ligand InfoPC cidPC sid
In DepthDetails US Patent
TargetLysine-specific histone demethylase 1A(Homo sapiens (Human))
Incyte
US Patent
LigandPNGBDBM388949(5-{7-(4-cyanophenyl)-5-[4-(dimethylamino)piperidin...)
Affinity DataIC50:  275nM. Assay description: LANCE LSD1/KDM1A demethylase assay 10 μL of 1 nM LSD-1 enzyme (ENZO BML-SE544-0050) in the assay buffer (50 mM Tris, pH 7.5, 0.01% Tween-20, 25 ...
Ligand InfoPC cidPC sid
In DepthDetails US Patent
TargetLysine-specific histone demethylase 1A(Homo sapiens (Human))
Incyte
US Patent
LigandPNGBDBM388949(5-{7-(4-cyanophenyl)-5-[4-(dimethylamino)piperidin...)
Affinity DataIC50:  275nM. Assay description: LANCE LSD1/KDM1A demethylase assay—10 μL of 1 nM LSD-1 enzyme (ENZO BML-SE544-0050) in the assay buffer (50 mM Tris, pH 7.5, 0.01% Tween-20, 25 ...
Ligand InfoPC cidPC sid
In DepthDetails US Patent