BDBM391993 US10301269, Number 39::US10800744, Number 39::{2-[(1S)-1-({[(4- methoxyphenyl)amino] carbonyl}amino)-2- methylpropyl]-1H- imidazol-1-yl}acetic acid
SMILES COc1ccc(NC(=O)N[C@@H](C(C)C)c2nccn2CC(O)=O)cc1
InChI Key InChIKey=DOOXSIMYNFRGPK-HNNXBMFYSA-N
Data  2 EC50
  Tab Delimited (TSV)   2D SDfile   Computed 3D by Vconf -m prep SDfile
Find this compound or compounds like it in BindingDB:
Activity Spreadsheet -- Enzyme Inhibition Constant Data from BindingDB
Found 2 hits for monomerid = 391993
TargetN-formyl peptide receptor 2(Homo sapiens (Human))
Allergan
US Patent
LigandPNGBDBM391993(US10301269, Number 39 | US10800744, Number 39 | {2...)
Affinity DataEC50:  106nM. Assay description: Biological activity of compounds according to Formula I is set forth in Table 7 below. CHO-Gα16 cells stably expressing FPR2 were cultured in (F...
Ligand InfoPC cidPC sid
In DepthDetails US Patent
TargetN-formyl peptide receptor 2(Homo sapiens (Human))
Allergan
US Patent
LigandPNGBDBM391993(US10301269, Number 39 | US10800744, Number 39 | {2...)
Affinity DataEC50:  106nM. Assay description: Biological activity of compounds according to Formula I is set forth in Table 7 below. CHO-Gα16 cells stably expressing FPR2 were cultured in (F...
Ligand InfoPC cidPC sid
In DepthDetails US Patent