BDBM392586 N-((6-amino-2,4-dimethylpyridin-3- yl)methyl)-3-cyano-1-((3- (trifluoromethyl)quinolin-6- yl)methyl)-1H-pyrazole-4- carboxamide::US10301284, Example 73::US10781200, Example 73
SMILES Cc1cc(N)nc(C)c1CNC(=O)c1cn(Cc2ccc3ncc(cc3c2)C(F)(F)F)nc1C#N
InChI Key InChIKey=AFPHIOZWMKEEPJ-UHFFFAOYSA-N
Data  2 IC50
  Tab Delimited (TSV)   2D SDfile   Computed 3D by Vconf -m prep SDfile
Find this compound or compounds like it in BindingDB:
Activity Spreadsheet -- Enzyme Inhibition Constant Data from BindingDB
Found 2 hits for monomerid = 392586
TargetPlasma kallikrein(Homo sapiens (Human))
Attune Pharmaceuticals
US Patent
LigandPNGBDBM392586(N-((6-amino-2,4-dimethylpyridin-3- yl)methyl)-3-cy...)
Affinity DataIC50: <100nM. Assay description: A 10 mM solution of the test compound was made in DMSO. This solution was serially diluted 1:5 in DMSO to yield 2000, 400, 80, 16, 3.2, 0.64, 0.128, ...
Ligand InfoPC cidPC sid
In DepthDetails US Patent
TargetPlasma kallikrein(Homo sapiens (Human))
Attune Pharmaceuticals
US Patent
LigandPNGBDBM392586(N-((6-amino-2,4-dimethylpyridin-3- yl)methyl)-3-cy...)
Affinity DataIC50: <100nM. Assay description: A 10 mM solution of the test compound was made in DMSO. This solution was serially diluted 1:5 in DMSO to yield 2000, 400, 80, 16, 3.2, 0.64, 0.128, ...
Ligand InfoPC cidPC sid
In DepthDetails US Patent