BDBM392592 N-((6-amino-2-methylpyridin-3- yl)methyl)-5-((3-chloroquinolin-6- yl)methyl)-1,3,4-oxadiazole-2- carboxamide::US10301284, Example 79::US10781200, Example 79
SMILES Cc1nc(N)ccc1CNC(=O)c1nnc(Cc2ccc3ncc(Cl)cc3c2)o1
InChI Key InChIKey=AQHZJJWUYYGRQM-UHFFFAOYSA-N
Data  2 IC50
  Tab Delimited (TSV)   2D SDfile   Computed 3D by Vconf -m prep SDfile
Find this compound or compounds like it in BindingDB:
Activity Spreadsheet -- Enzyme Inhibition Constant Data from BindingDB
Found 2 hits for monomerid = 392592
TargetPlasma kallikrein(Homo sapiens (Human))
Attune Pharmaceuticals
US Patent
LigandPNGBDBM392592(N-((6-amino-2-methylpyridin-3- yl)methyl)-5-((3-ch...)
Affinity DataIC50:  550nM. Assay description: A 10 mM solution of the test compound was made in DMSO. This solution was serially diluted 1:5 in DMSO to yield 2000, 400, 80, 16, 3.2, 0.64, 0.128, ...
Ligand InfoPC cidPC sid
In DepthDetails US Patent
TargetPlasma kallikrein(Homo sapiens (Human))
Attune Pharmaceuticals
US Patent
LigandPNGBDBM392592(N-((6-amino-2-methylpyridin-3- yl)methyl)-5-((3-ch...)
Affinity DataIC50:  550nM. Assay description: A 10 mM solution of the test compound was made in DMSO. This solution was serially diluted 1:5 in DMSO to yield 2000, 400, 80, 16, 3.2, 0.64, 0.128, ...
Ligand InfoPC cidPC sid
In DepthDetails US Patent