BDBM392633 N-((6-amino-2,4-dimethylpyridin-3- yl)methyl)-1-((3-chloroquinolin-6- yl)methyl)-4-oxo-4,5-dihydro-1H- pyrazolo[4,3-c]pyridine-3- carboxamide::US10301284, Example 120::US10781200, Example 120
SMILES Cc1cc(N)nc(C)c1CNC(=O)c1nn(Cc2ccc3ncc(Cl)cc3c2)c2cc[nH]c(=O)c12
InChI Key InChIKey=JGZHQZLALCTIAI-UHFFFAOYSA-N
Data  2 IC50
  Tab Delimited (TSV)   2D SDfile   Computed 3D by Vconf -m prep SDfile
Find this compound or compounds like it in BindingDB:
Activity Spreadsheet -- Enzyme Inhibition Constant Data from BindingDB
Found 2 hits for monomerid = 392633
TargetPlasma kallikrein(Homo sapiens (Human))
Attune Pharmaceuticals
US Patent
LigandPNGBDBM392633(N-((6-amino-2,4-dimethylpyridin-3- yl)methyl)-1-((...)
Affinity DataIC50:  5.50E+3nM. Assay description: A 10 mM solution of the test compound was made in DMSO. This solution was serially diluted 1:5 in DMSO to yield 2000, 400, 80, 16, 3.2, 0.64, 0.128, ...
Ligand InfoPC cidPC sid
In DepthDetails US Patent
TargetPlasma kallikrein(Homo sapiens (Human))
Attune Pharmaceuticals
US Patent
LigandPNGBDBM392633(N-((6-amino-2,4-dimethylpyridin-3- yl)methyl)-1-((...)
Affinity DataIC50:  5.50E+3nM. Assay description: A 10 mM solution of the test compound was made in DMSO. This solution was serially diluted 1:5 in DMSO to yield 2000, 400, 80, 16, 3.2, 0.64, 0.128, ...
Ligand InfoPC cidPC sid
In DepthDetails US Patent