BDBM39372 2-amino-6-ethyl-5-methyl-4-(1-methyl-2-pyrrolyl)-3-pyridinecarbonitrile::2-amino-6-ethyl-5-methyl-4-(1-methylpyrrol-2-yl)nicotinonitrile::2-amino-6-ethyl-5-methyl-4-(1-methylpyrrol-2-yl)pyridine-3-carbonitrile::2-azanyl-6-ethyl-5-methyl-4-(1-methylpyrrol-2-yl)pyridine-3-carbonitrile::MLS000080373::SMR000035574::cid_662334
SMILES CCc1nc(N)c(C#N)c(-c2cccn2C)c1C
InChI Key InChIKey=MJGKITIFCHNMOT-UHFFFAOYSA-N
Data  1 IC50
  Tab Delimited (TSV)   2D SDfile   Computed 3D by Vconf -m prep SDfile
Find this compound or compounds like it in BindingDB:
Activity Spreadsheet -- Enzyme Inhibition Constant Data from BindingDB
Found 1 hit for monomerid = 39372
TargetGenome polyprotein(West Nile virus)
University Of Pittsburgh
Curated by PubChem BioAssay
LigandPNGBDBM39372(2-amino-6-ethyl-5-methyl-4-(1-methyl-2-pyrrolyl)-3...)
Affinity DataIC50: >5.00E+4nM. Assay description: The HTS assay to identify Inhibitors of West Nile Virus (WNV) NS2bNS3 Proteinase was proposed by Dr Alex Strongin of the Burnham Institute XO1-MH0776...
In DepthDetails PCBioAssay