BDBM39417 2-(4-chloroanilino)-3-(2-furanylmethyliminomethyl)-9-methyl-4-pyrido[1,2-a]pyrimidinone::2-(4-chloroanilino)-3-(2-furfuryliminomethyl)-9-methyl-pyrido[1,2-a]pyrimidin-4-one::2-(4-chloroanilino)-3-(furan-2-ylmethyliminomethyl)-9-methylpyrido[1,2-a]pyrimidin-4-one::2-[(4-chlorophenyl)amino]-3-(furan-2-ylmethyliminomethyl)-9-methyl-pyrido[1,2-a]pyrimidin-4-one::MLS000100636::SMR000015745::cid_2312310
SMILES Cc1cccn2c1nc(Nc1ccc(Cl)cc1)c(\C=N\Cc1ccco1)c2=O
InChI Key InChIKey=REUYQVQOFNTMJO-YDZHTSKRSA-N
Data  1 IC50
  Tab Delimited (TSV)   2D SDfile   Computed 3D by Vconf -m prep SDfile
Find this compound or compounds like it in BindingDB:
Activity Spreadsheet -- Enzyme Inhibition Constant Data from BindingDB
Found 1 hit for monomerid = 39417
TargetGenome polyprotein(West Nile virus)
University Of Pittsburgh
Curated by PubChem BioAssay
LigandPNGBDBM39417(2-(4-chloroanilino)-3-(2-furanylmethyliminomethyl)...)
Affinity DataIC50: >5.00E+4nM. Assay description: The HTS assay to identify Inhibitors of West Nile Virus (WNV) NS2bNS3 Proteinase was proposed by Dr Alex Strongin of the Burnham Institute XO1-MH0776...
In DepthDetails PCBioAssay