BDBM39423 Furan-2-carboxylic acid {5-[(thiophene-2-carbonyl)-amino]-pyridin-2-yl}-amide::MLS000034423::N-[5-(2-thenoylamino)-2-pyridyl]-2-furamide::N-[5-(thiophen-2-ylcarbonylamino)pyridin-2-yl]furan-2-carboxamide::N-[5-(thiophene-2-carbonylamino)pyridin-2-yl]furan-2-carboxamide::N-[5-[[oxo(thiophen-2-yl)methyl]amino]-2-pyridinyl]-2-furancarboxamide::SMR000005507::cid_647091
SMILES O=C(Nc1ccc(NC(=O)c2cccs2)cn1)c1ccco1
InChI Key InChIKey=NMCUOQSDFBGTMF-UHFFFAOYSA-N
Data  2 EC50
  Tab Delimited (TSV)   2D SDfile   Computed 3D by Vconf -m prep SDfile
Find this compound or compounds like it in BindingDB:
Activity Spreadsheet -- Enzyme Inhibition Constant Data from BindingDB
Found 2 hits for monomerid = 39423
TargetIsoform 2 of Nuclear receptor ROR-alpha (Alpha-2)(Homo sapiens (Human))
The Scripps Research Institute Molecular Screening Center
Curated by PubChem BioAssay
LigandPNGBDBM39423(Furan-2-carboxylic acid {5-[(thiophene-2-carbonyl)...)
Affinity DataEC50:  2.71E+3nM. Assay description: Source (MLSCN Center Name): The Scripps Research Institute Molecular Screening Center Center Affiliation: The Scripps Research Institute, TSRI Assay ...
Ligand InfoPC cidPC sid
In DepthDetails PCBioAssay
TargetSteroidogenic factor 1(Homo sapiens (Human))
The Scripps Research Institute Molecular Screening Center
Curated by PubChem BioAssay
LigandPNGBDBM39423(Furan-2-carboxylic acid {5-[(thiophene-2-carbonyl)...)
Affinity DataEC50:  5.54E+3nM. Assay description: Source (MLSCN Center Name): The Scripps Research Institute Molecular Screening Center Center Affiliation: The Scripps Research Institute, TSRI Assay ...
Ligand InfoPC cidPC sid
In DepthDetails PCBioAssay