BDBM394288 US10428087, Example 7::US10829502, Example 7::US11401280, Example 7::US9975907, Example 7
SMILES CCC(Nc1ncnc2[nH]cnc12)c1nc2cccc(C)n2c(=O)c1-c1cn[nH]c1
InChI Key
Data  8 IC50
  Tab Delimited (TSV)   2D SDfile   Computed 3D by Vconf -m prep SDfile
Find this compound or compounds like it in BindingDB:
Activity Spreadsheet -- Enzyme Inhibition Constant Data from BindingDB
Found 8 hits for monomerid = 394288
TargetPhosphatidylinositol 4,5-bisphosphate 3-kinase catalytic subunit delta isoform(Homo sapiens (Human))
Incyte Holdings
US Patent
LigandPNGBDBM394288(US10428087, Example 7 | US10829502, Example 7 | US...)
Affinity DataIC50:  300nM. Assay description: PI3-Kinase luminescent assay kit including lipid kinase substrate, D-myo-phosphatidylinositol 4,5-bisphosphate (PtdIns(4,5)P2)D (+)-sn-1,2-di-O-octan...
Ligand InfoKEGGPC cidPC sid
In DepthDetails US Patent
TargetPhosphatidylinositol 4,5-bisphosphate 3-kinase catalytic subunit delta isoform(Homo sapiens (Human))
Incyte Holdings
US Patent
LigandPNGBDBM394288(US10428087, Example 7 | US10829502, Example 7 | US...)
Affinity DataIC50:  75nM. Assay description: The kinase reaction was conducted in polystyrene 384-well matrix white plate from Thermo Fisher Scientific in a final volume of 25 μL. Inhibitor...
Ligand InfoKEGGPC cidPC sid
In DepthDetails US Patent
TargetPhosphatidylinositol 4,5-bisphosphate 3-kinase catalytic subunit delta isoform(Homo sapiens (Human))
Incyte Holdings
US Patent
LigandPNGBDBM394288(US10428087, Example 7 | US10829502, Example 7 | US...)
Affinity DataIC50:  300nM. Assay description: Assay A1: The kinase reaction was conducted in 384-well REMP plate from Thermo Fisher Scientific in a final volume of 40 μL. Inhibitors were fir...
Ligand InfoKEGGPC cidPC sid
In DepthDetails US Patent
TargetPhosphatidylinositol 4,5-bisphosphate 3-kinase catalytic subunit delta isoform(Homo sapiens (Human))
Incyte Holdings
US Patent
LigandPNGBDBM394288(US10428087, Example 7 | US10829502, Example 7 | US...)
Affinity DataIC50:  75nM. Assay description: PI3Kα, PI3Kβ, PI3Kγ: The kinase reaction was conducted in clear-bottom 96-well plate from Thermo Fisher Scientific in a final volume o...
Ligand InfoKEGGPC cidPC sid
In DepthDetails US Patent
TargetPhosphatidylinositol 4,5-bisphosphate 3-kinase catalytic subunit delta isoform(Homo sapiens (Human))
Incyte Holdings
US Patent
LigandPNGBDBM394288(US10428087, Example 7 | US10829502, Example 7 | US...)
Affinity DataIC50:  300nM. Assay description: Example A1: The kinase reaction was conducted in 384-well REMP plate from Thermo Fisher Scientific in a final volume of 40 μL. Inhibitors were f...
Ligand InfoKEGGPC cidPC sid
In DepthDetails US Patent
TargetPhosphatidylinositol 4,5-bisphosphate 3-kinase catalytic subunit delta isoform(Homo sapiens (Human))
Incyte Holdings
US Patent
LigandPNGBDBM394288(US10428087, Example 7 | US10829502, Example 7 | US...)
Affinity DataIC50:  75nM. Assay description: Example A3: The kinase reaction was conducted in polystyrene 384-well matrix white plate from Thermo Fisher Scientific in a final volume of 25 μ...
Ligand InfoKEGGPC cidPC sid
In DepthDetails US Patent
TargetPhosphatidylinositol 4,5-bisphosphate 3-kinase catalytic subunit delta isoform(Homo sapiens (Human))
Incyte Holdings
US Patent
LigandPNGBDBM394288(US10428087, Example 7 | US10829502, Example 7 | US...)
Affinity DataIC50:  300nM. Assay description: Assay A1 PI3Kδ: The kinase reaction was conducted in 384-well REMP plate from Thermo Fisher Scientific in a final volume of 40 μL. Inhibito...
Ligand InfoKEGGPC cidPC sid
In DepthDetails US Patent
TargetPhosphatidylinositol 4,5-bisphosphate 3-kinase catalytic subunit delta isoform(Homo sapiens (Human))
Incyte Holdings
US Patent
LigandPNGBDBM394288(US10428087, Example 7 | US10829502, Example 7 | US...)
Affinity DataIC50:  75nM. Assay description: Assay A2: The kinase reaction was conducted in clear-bottom 96-well plate from Thermo Fisher Scientific in a final volume of 24 μL. Inhibitors w...
Ligand InfoKEGGPC cidPC sid
In DepthDetails US Patent