BDBM39472 4-acetyl-N-(2,3-dihydro-1,4-benzodioxin-6-yl)-3,5-dimethyl-1H-pyrrole-2-carboxamide::4-acetyl-N-2,3-dihydro-1,4-benzodioxin-6-yl-3,5-dimethyl-1H-pyrrole-2-carboxamide::MLS000045232::N-(2,3-dihydro-1,4-benzodioxin-6-yl)-4-ethanoyl-3,5-dimethyl-1H-pyrrole-2-carboxamide::SMR000026824::cid_3239225
SMILES CC(=O)c1c(C)[nH]c(C(=O)Nc2ccc3OCCOc3c2)c1C
InChI Key InChIKey=JXRJLDVOEJJWAP-UHFFFAOYSA-N
Data  3 EC50
  Tab Delimited (TSV)   2D SDfile   Computed 3D by Vconf -m prep SDfile
Find this compound or compounds like it in BindingDB:
Activity Spreadsheet -- Enzyme Inhibition Constant Data from BindingDB
Found 3 hits for monomerid = 39472
TargetSteroidogenic factor 1(Homo sapiens (Human))
The Scripps Research Institute Molecular Screening Center
Curated by PubChem BioAssay
LigandPNGBDBM39472(4-acetyl-N-(2,3-dihydro-1,4-benzodioxin-6-yl)-3,5-...)
Affinity DataEC50:  466nM. Assay description: Source (MLSCN Center Name): The Scripps Research Institute Molecular Screening Center Center Affiliation: The Scripps Research Institute, TSRI Assay ...
In DepthDetails PCBioAssay
TargetTranscription factor p65(Homo sapiens (Human))
Srmlsc
Curated by PubChem BioAssay
LigandPNGBDBM39472(4-acetyl-N-(2,3-dihydro-1,4-benzodioxin-6-yl)-3,5-...)
Affinity DataEC50:  5.26E+3nM. Assay description: Southern Research Molecular Libraries Screening Center (SRMLSC) Southern Research Institute (Birmingham, Alabama) NIH Molecular Libraries Screening C...
In DepthDetails PCBioAssay
TargetIsoform 2 of Nuclear receptor ROR-alpha (Alpha-2)(Homo sapiens (Human))
The Scripps Research Institute Molecular Screening Center
Curated by PubChem BioAssay
LigandPNGBDBM39472(4-acetyl-N-(2,3-dihydro-1,4-benzodioxin-6-yl)-3,5-...)
Affinity DataEC50:  400nM. Assay description: Source (MLSCN Center Name): The Scripps Research Institute Molecular Screening Center Center Affiliation: The Scripps Research Institute, TSRI Assay ...
In DepthDetails PCBioAssay