BDBM39603 2-[5-(4-chlorophenyl)-1,2,3,4-tetrazol-2-yl]-N-[2-(cyclohexen-1-yl)ethyl]ethanamide::2-[5-(4-chlorophenyl)-2-tetrazolyl]-N-[2-(1-cyclohexenyl)ethyl]acetamide::2-[5-(4-chlorophenyl)tetrazol-2-yl]-N-[2-(cyclohexen-1-yl)ethyl]acetamide::MLS000054709::SMR000065429::cid_2529131
SMILES Clc1ccc(cc1)-c1nnn(CC(=O)NCCC2=CCCCC2)n1
InChI Key InChIKey=LATDMSIFEWVJSS-UHFFFAOYSA-N
Data  1 IC50  1 EC50
  Tab Delimited (TSV)   2D SDfile   Computed 3D by Vconf -m prep SDfile
Find this compound or compounds like it in BindingDB:
Activity Spreadsheet -- Enzyme Inhibition Constant Data from BindingDB
Found 2 hits for monomerid = 39603
TargetAlkaline phosphatase, germ cell type(Homo sapiens (Human))
Burnham Center For Chemical Genomics
Curated by PubChem BioAssay
LigandPNGBDBM39603(2-[5-(4-chlorophenyl)-1,2,3,4-tetrazol-2-yl]-N-[2-...)
Affinity DataEC50:  9.99E+5nM. Assay description: Sanford-Burnham Center for Chemical Genomics (SBCCG) Sanford-Burnham Medical Research Institute (SBMRI, San Diego, CA) NIH Molecular Libraries Screen...
In DepthDetails PCBioAssay
TargetAlkaline phosphatase, germ cell type(Homo sapiens (Human))
Burnham Center For Chemical Genomics
Curated by PubChem BioAssay
LigandPNGBDBM39603(2-[5-(4-chlorophenyl)-1,2,3,4-tetrazol-2-yl]-N-[2-...)
Affinity DataIC50:  9.99E+5nM. Assay description: Sanford-Burnham Center for Chemical Genomics (SBCCG) Sanford-Burnham Medical Research Institute (SBMRI, San Diego, CA) NIH Molecular Libraries Screen...
In DepthDetails PCBioAssay