BDBM396276 US10314827, Compound 27::US10314827, Compound 33
SMILES C[C@@H]1[C@H]2[C@@H](C[C@H](C)CN2C(=O)OCc2ccccc2)O[C@]11CC[C@H]2[C@@H]3CC[C@@H]4C[C@H](O)CC[C@]4(C)[C@H]3CC2=C(C)C1
InChI Key InChIKey=ISJVNSARWLMBRK-UIIKCBRRSA-N
Data  2 EC50
  Tab Delimited (TSV)   2D SDfile   Computed 3D by Vconf -m prep SDfile
Find this compound or compounds like it in BindingDB:
Activity Spreadsheet -- Enzyme Inhibition Constant Data from BindingDB
Found 2 hits for monomerid = 396276
TargetAlkaline phosphatase, germ cell type(Homo sapiens (Human))
Infinity Pharmaceuticals
US Patent
LigandPNGBDBM396276(US10314827, Compound 27 | US10314827, Compound 33)
Affinity DataEC50: >100nM. Assay description: C3H10T1/2 cells were plated in 96 wells with a density of 8×103 cells/well. Cells were grown to confluence (72 hrs). After sonic Hedgehog (250 ng/ml)...
Ligand InfoPC cidPC sid
In DepthDetails US Patent
TargetAlkaline phosphatase, germ cell type(Homo sapiens (Human))
Infinity Pharmaceuticals
US Patent
LigandPNGBDBM396276(US10314827, Compound 27 | US10314827, Compound 33)
Affinity DataEC50:  60nM. Assay description: C3H10T1/2 cells were plated in 96 wells with a density of 8×103 cells/well. Cells were grown to confluence (72 hrs). After sonic Hedgehog (250 ng/ml)...
Ligand InfoPC cidPC sid
In DepthDetails US Patent