BDBM396280 US10314827, Compound 35
SMILES C[C@@H]1[C@@H]2NC[C@@H](C)C[C@H]2O[C@]11CC[C@H]2[C@@H]3CC[C@@H]4C[C@H](CC[C@]4(C)[C@H]3CC2=C(C)C1)OC(C)=O
InChI Key InChIKey=PVBOHVWWWYCIGX-FJBHCLDISA-N
Data  1 EC50
  Tab Delimited (TSV)   2D SDfile   Computed 3D by Vconf -m prep SDfile
Find this compound or compounds like it in BindingDB:
Activity Spreadsheet -- Enzyme Inhibition Constant Data from BindingDB
Found 1 hit for monomerid = 396280
TargetAlkaline phosphatase, germ cell type(Homo sapiens (Human))
Infinity Pharmaceuticals
US Patent
LigandPNGBDBM396280(US10314827, Compound 35)
Affinity DataEC50: <20nM. Assay description: C3H10T1/2 cells were plated in 96 wells with a density of 8×103 cells/well. Cells were grown to confluence (72 hrs). After sonic Hedgehog (250 ng/ml)...
Ligand InfoPC cidPC sid
In DepthDetails US Patent