BDBM398514 US10323020, Example 8::[4-(3,4-Dihydroisoquinolin-2(1H)-yl)piperidin-1-yl][2-(2-oxa-6-azaspiro[3.3]hept-6-yl)pyrimidin-5-yl]methanone
SMILES O=C(N1CCC(CC1)N1CCc2ccccc2C1)c1cnc(nc1)N1CC2(COC2)C1
InChI Key InChIKey=QFUYPQVPOWDETM-UHFFFAOYSA-N
Data  1 IC50
  Tab Delimited (TSV)   2D SDfile   Computed 3D by Vconf -m prep SDfile
Find this compound or compounds like it in BindingDB:
Activity Spreadsheet -- Enzyme Inhibition Constant Data from BindingDB
Found 1 hit for monomerid = 398514
TargetAlpha-2C adrenergic receptor(Homo sapiens (Human))
Bayer Pharma Aktiengesellschaft
US Patent
LigandPNGBDBM398514(US10323020, Example 8 | [4-(3,4-Dihydroisoquinolin...)
Affinity DataIC50:  23nM. Assay description: Antagonism against the adrenoreceptor α1A was tested using a recombinant human α1A receptor CHO cell line which additionally also recombina...
Ligand InfoPC cidPC sid
In DepthDetails US Patent